program: Orca
programVersion: 5.0.2
elementType: Cl F F F O O O N C C C C C C C C C C C C C C C C C C C C C C C H H H H H H H H H H H H H H H H H H H
charge: 0
multiplicity: 1
keywords: wb97x-d3
keywords: def2-TZVPP
keywords: def2/J RIJCOSX
keywords: DEFGRID2
keywords: scfconv7
keywords: smallprint printgap noloewdin
keywords: NOSOSCF
formula: C23H19ClF3NO3
InChI: InChI=1/C23H19ClF3NO3/c1-22(2)17(12-19(24)23(25,26)27)20(22)21(29)31-18(13-28)14-7-6-10-16(11-14)30-15-8-4-3-5-9-15/h3-12,17-18,20H,1-2H3
50 atoms
Cl 1.916987 -0.073217 -2.272221
F  4.178829 1.110909 -0.790862
F  4.91304 -0.673047 -1.735538
F  4.671011 -0.610785 0.404645
O  -2.01716 -1.698206 0.343329
O  -1.660964 -1.575417 2.553551
O  -1.591971 3.515202 0.258242
N  -5.061148 -2.703156 -0.517254
C  0.447773 -3.507949 0.234101
C  0.798552 -2.089844 -0.125091
C  0.075274 -2.391387 1.178895
C  -0.583837 -4.212904 -0.614344
C  1.5297 -4.443607 0.724898
C  2.165019 -1.574611 -0.048786
C  -1.278694 -1.862182 1.454276
C  2.726273 -0.718528 -0.894873
C  -3.28584 -1.056875 0.46212
C  4.133244 -0.221577 -0.754159
C  -3.221434 0.273621 -0.248014
C  -4.280024 -1.9749 -0.094803
C  -2.465136 1.272636 0.35734
C  -3.834414 0.500023 -1.469527
C  -2.303365 2.49314 -0.280842
C  -3.688516 1.736956 -2.083737
C  -2.922015 2.729952 -1.50403
C  -0.511615 3.245283 1.056456
C  0.497097 2.382577 0.645388
C  -0.426437 3.908069 2.270421
C  1.593147 2.184797 1.469748
C  0.6826 3.708869 3.079687
C  1.691042 2.843181 2.687152
H  0.183697 -1.656083 -0.904142
H  0.682542 -2.341574 2.075687
H  -0.080414 -4.760737 -1.412249
H  -1.143065 -4.937114 -0.020038
H  -1.29735 -3.539611 -1.080241
H  2.236676 -3.969477 1.404548
H  1.084388 -5.2826 1.260684
H  2.095534 -4.847849 -0.115662
H  2.774791 -1.908375 0.781206
H  -3.528717 -0.907083 1.518502
H  -2.005889 1.09935 1.323796
H  -4.425639 -0.271241 -1.945117
H  -4.168808 1.922069 -3.034977
H  -2.796444 3.689867 -1.987073
H  0.4380 1.878182 -0.311211
H  -1.219908 4.57978 2.570164
H  2.383269 1.520783 1.150669
H  0.751534 4.229645 4.02544
H  2.553418 2.687506 3.320974
totalener: -1928.16227067 hartree
nucrepener: 3321.70054537 hartree
electener: -5249.86281604 hartree
oneelecener: -9249.65573185 hartree
twoeener: 3999.79291582 hartree
kineticenergy: 1921.68366829 hartree
xcener: -157.122521339140 hartree
chargesum: 0.0000000
charge: -0.053406 -0.159957 -0.157046 -0.175157 -0.263455 -0.343142 -0.297081 0.002085 0.052244 0.079847 -0.088909 -0.237678 -0.246324 -0.175985 0.344554 -0.103599 0.305785 0.532366 -0.009441 -0.281873 -0.156249 -0.170289 0.202266 -0.081933 -0.199914 0.249238 -0.190979 -0.212213 -0.057049 -0.074750 -0.173147 0.087744 0.086273 0.089644 0.098248 0.093548 0.075047 0.099487 0.100964 0.116684 0.139347 0.144772 0.127185 0.131012 0.129468 0.126188 0.126423 0.117749 0.126432 0.124981
qa: -0.0534 -0.1600 -0.1570 -0.1752 -0.2635 -0.3431 -0.2971 0.0021 0.0522 0.0798 -0.0889 -0.2377 -0.2463 -0.1760 0.3446 -0.1036 0.3058 0.5324 -0.0094 -0.2819 -0.1562 -0.1703 0.2023 -0.0819 -0.1999 0.2492 -0.1910 -0.2122 -0.0570 -0.0747 -0.1731 0.0877 0.0863 0.0896 0.0982 0.0935 0.0750 0.0995 0.1010 0.1167 0.1393 0.1448 0.1272 0.1310 0.1295 0.1262 0.1264 0.1177 0.1264 0.1250
va: 1.2769 1.1434 1.1519 1.1266 2.0877 2.1617 2.1188 3.1146 3.7992 3.7115 3.8491 3.9133 3.9178 3.8775 4.2701 4.0466 3.8134 4.4435 3.8011 4.0393 3.8743 3.9971 3.8742 3.9641 4.0430 3.8380 3.9614 4.0543 3.8622 3.9188 4.0273 1.0479 1.0318 1.0021 1.0026 1.0180 1.0109 1.0035 1.0017 1.0318 1.0259 1.0166 1.0213 0.9993 1.0115 1.0163 1.0131 1.0181 0.9984 1.0024
dispcorr: -0.029046794 hartree
energy: -1928.191317461117
dipole: -21.15551 21.88083 0.72532 -11.34517 11.19493 -0.15024 12.50032 -12.33524 0.16508
magnitude: 0.75889 au
magnitude: 1.92894 debye
