program: Orca
programVersion: 5.0.2
elementType: Cl F F F O O O N C C C C C C C C C C C C C C C C C C C C C C C H H H H H H H H H H H H H H H H H H H
charge: 0
multiplicity: 1
keywords: wb97x-d3
keywords: def2-TZVPP
keywords: def2/J RIJCOSX
keywords: DEFGRID2
keywords: scfconv7
keywords: smallprint printgap noloewdin
keywords: NOSOSCF
formula: C23H19ClF3NO3
InChI: InChI=1/C23H19ClF3NO3/c1-22(2)17(12-19(24)23(25,26)27)20(22)21(29)31-18(13-28)14-7-6-10-16(11-14)30-15-8-4-3-5-9-15/h3-12,17-18,20H,1-2H3
50 atoms
Cl 3.887663 -3.774828 1.290065
F  5.55497 -4.896774 -0.975596
F  3.946327 -4.957768 -2.406721
F  3.829786 -6.119176 -0.597653
O  -1.457959 -1.059101 -0.775625
O  -0.238018 -0.710438 1.070665
O  -2.562755 3.631793 2.007307
N  -4.571553 -2.112664 -1.159436
C  2.073651 -0.409773 -1.027887
C  2.136548 -1.766732 -0.384197
C  0.835389 -1.278132 -0.992602
C  2.195729 0.796378 -0.12825
C  2.693683 -0.192358 -2.388007
C  2.816833 -2.897806 -1.018645
C  -0.302253 -0.982122 -0.096765
C  3.568439 -3.801756 -0.401576
C  -2.64828 -0.725575 -0.063601
C  4.228623 -4.951833 -1.101779
C  -2.923819 0.755896 -0.140781
C  -3.716991 -1.509002 -0.686565
C  -2.633039 1.5548 0.952348
C  -3.418387 1.318914 -1.313036
C  -2.850836 2.92743 0.883674
C  -3.630741 2.683636 -1.368672
C  -3.354038 3.497167 -0.278563
C  -2.545211 5.00105 1.955014
C  -3.572666 5.706485 2.559321
C  -1.492441 5.662363 1.338819
C  -3.541005 7.093789 2.55054
C  -1.474568 7.048265 1.330537
C  -2.497487 7.766921 1.93372
H  2.160901 -1.751853 0.69923
H  0.551442 -1.713441 -1.944068
H  3.244713 1.085571 -0.050107
H  1.648566 1.643648 -0.545304
H  1.82446 0.619499 0.87736
H  2.271112 0.699181 -2.853073
H  3.770547 -0.042789 -2.297881
H  2.529957 -1.020733 -3.07605
H  2.689201 -3.018188 -2.086889
H  -2.568668 -1.038354 0.981753
H  -2.232071 1.125866 1.861749
H  -3.65228 0.69752 -2.167834
H  -4.027558 3.129265 -2.270858
H  -3.539598 4.560788 -0.341613
H  -4.382853 5.171097 3.036631
H  -0.694345 5.095275 0.87692
H  -4.339291 7.648469 3.025386
H  -0.654193 7.568318 0.85412
H  -2.477714 8.848236 1.926956
totalener: -1928.16613467 hartree
nucrepener: 3026.52279199 hartree
electener: -4954.68892666 hartree
oneelecener: -8659.73852868 hartree
twoeener: 3705.04960202 hartree
kineticenergy: 1921.68198353 hartree
xcener: -157.120353556813 hartree
chargesum: -0.0000000
charge: -0.047423 -0.159863 -0.170309 -0.158254 -0.256090 -0.381744 -0.291201 -0.001335 0.059386 0.036089 -0.096380 -0.250748 -0.242138 -0.152496 0.365645 -0.078045 0.310296 0.506626 0.000188 -0.257098 -0.163124 -0.165681 0.228197 -0.132855 -0.153820 0.189912 -0.153711 -0.145660 -0.118757 -0.124351 -0.117521 0.090864 0.084516 0.092464 0.088850 0.105041 0.095588 0.101195 0.074681 0.116013 0.123396 0.120198 0.121168 0.130252 0.131104 0.127942 0.131349 0.129363 0.128759 0.129520
qa: -0.0474 -0.1599 -0.1703 -0.1583 -0.2561 -0.3817 -0.2912 -0.0013 0.0594 0.0361 -0.0964 -0.2507 -0.2421 -0.1525 0.3656 -0.0780 0.3103 0.5066 0.0002 -0.2571 -0.1631 -0.1657 0.2282 -0.1329 -0.1538 0.1899 -0.1537 -0.1457 -0.1188 -0.1244 -0.1175 0.0909 0.0845 0.0925 0.0889 0.1050 0.0956 0.1012 0.0747 0.1160 0.1234 0.1202 0.1212 0.1303 0.1311 0.1279 0.1313 0.1294 0.1288 0.1295
va: 1.2878 1.1451 1.1324 1.1488 2.1361 2.1200 2.1133 3.1157 3.7784 3.8018 3.8838 3.9165 3.9089 3.8881 4.2301 4.0693 3.8267 4.4813 3.6956 4.0247 4.0318 4.0360 3.8950 3.9902 3.9284 3.8500 4.0147 3.9815 3.9424 3.9454 3.9388 1.0510 1.0359 1.0015 1.0016 1.0204 1.0038 1.0022 1.0111 1.0290 1.0185 1.0344 1.0164 1.0015 1.0094 1.0098 1.0041 0.9992 0.9998 0.9994
dispcorr: -0.023966392 hartree
energy: -1928.190101060331
dipole: -25.35821 25.74692 0.38871 56.68448 -54.09010 2.59438 -1.67844 1.29577 -0.38267
magnitude: 2.65110 au
magnitude: 6.73856 debye
