program: Orca
programVersion: 5.0.2
elementType: Cl F F F O O O N C C C C C C C C C C C C C C C C C C C C C C C H H H H H H H H H H H H H H H H H H H
charge: 0
multiplicity: 1
keywords: wb97x-d3
keywords: def2-TZVPP
keywords: def2/J RIJCOSX
keywords: DEFGRID2
keywords: scfconv7
keywords: smallprint printgap noloewdin
keywords: NOSOSCF
formula: C23H19ClF3NO3
InChI: InChI=1/C23H19ClF3NO3/c1-22(2)17(12-19(24)23(25,26)27)20(22)21(29)31-18(13-28)14-7-6-10-16(11-14)30-15-8-4-3-5-9-15/h3-12,17-18,20H,1-2H3
50 atoms
Cl 1.509843 0.825254 0.304484
F  4.506278 0.760229 0.235799
F  4.717562 -1.25005 0.976292
F  3.799869 0.265317 2.201767
O  -2.01106 -1.850705 -0.35206
O  -1.987924 -2.806022 1.668773
O  -0.728245 3.080164 0.359368
N  -4.41947 -0.57187 -2.233837
C  0.500841 -3.472976 -0.995613
C  0.870762 -2.107212 -0.50873
C  -0.052674 -2.990483 0.326048
C  -0.362447 -3.581816 -2.230917
C  1.499235 -4.6031 -0.887225
C  2.192868 -1.759114 0.028236
C  -1.435293 -2.566487 0.632827
C  2.561001 -0.535131 0.389897
C  -3.191014 -1.136993 0.001028
C  3.907383 -0.190395 0.953277
C  -2.830703 0.115683 0.761121
C  -3.867546 -0.830722 -1.260422
C  -2.001364 1.051633 0.156805
C  -3.253486 0.288876 2.069663
C  -1.597915 2.168471 0.872006
C  -2.84921 1.414394 2.772408
C  -2.02372 2.355051 2.181188
C  -0.845057 3.485869 -0.942415
C  0.330562 3.724115 -1.638837
C  -2.078797 3.710757 -1.539711
C  0.26776 4.198043 -2.940045
C  -2.125138 4.173419 -2.845586
C  -0.95701 4.4203 -3.551368
H  0.362778 -1.291962 -1.010839
H  0.39877 -3.451405 1.196861
H  0.275947 -3.679582 -3.110076
H  -0.995169 -4.469382 -2.183788
H  -1.004601 -2.720083 -2.388132
H  2.073108 -4.584655 0.039176
H  0.981472 -5.562423 -0.920462
H  2.203731 -4.577567 -1.72017
H  2.920519 -2.552333 0.146601
H  -3.860385 -1.762463 0.599363
H  -1.664109 0.909733 -0.863307
H  -3.877708 -0.456422 2.544032
H  -3.174155 1.556556 3.794086
H  -1.696312 3.22978 2.727274
H  1.284175 3.54618 -1.159546
H  -2.997195 3.531659 -0.9956
H  1.18613 4.386449 -3.480156
H  -3.086923 4.344909 -3.310185
H  -1.001732 4.783139 -4.569076
totalener: -1928.16041887 hartree
nucrepener: 3333.63229443 hartree
electener: -5261.79271330 hartree
oneelecener: -9274.20866650 hartree
twoeener: 4012.41595320 hartree
kineticenergy: 1921.68403999 hartree
xcener: -157.122395549623 hartree
chargesum: -0.0000000
charge: -0.054601 -0.161526 -0.169817 -0.158854 -0.280971 -0.340304 -0.303845 0.002777 0.095220 -0.035960 -0.041848 -0.235726 -0.278655 -0.144975 0.320943 -0.045122 0.309290 0.495988 0.072498 -0.274836 -0.208562 -0.130624 0.196528 -0.083035 -0.211574 0.247967 -0.202009 -0.164891 -0.097920 -0.110388 -0.146266 0.090437 0.091832 0.088514 0.094452 0.098021 0.075626 0.099388 0.104871 0.125375 0.122922 0.135277 0.113470 0.129245 0.131512 0.127080 0.131444 0.126606 0.129218 0.125806
qa: -0.0546 -0.1615 -0.1698 -0.1589 -0.2810 -0.3403 -0.3038 0.0028 0.0952 -0.0360 -0.0418 -0.2357 -0.2787 -0.1450 0.3209 -0.0451 0.3093 0.4960 0.0725 -0.2748 -0.2086 -0.1306 0.1965 -0.0830 -0.2116 0.2480 -0.2020 -0.1649 -0.0979 -0.1104 -0.1463 0.0904 0.0918 0.0885 0.0945 0.0980 0.0756 0.0994 0.1049 0.1254 0.1229 0.1353 0.1135 0.1292 0.1315 0.1271 0.1314 0.1266 0.1292 0.1258
va: 1.3178 1.1472 1.1338 1.1470 2.1052 2.1684 2.0719 3.1140 3.8125 3.8295 3.8037 3.9016 3.9297 3.8745 4.2868 4.0300 3.8842 4.4957 3.6024 4.0178 3.9311 4.0012 3.7869 3.9478 4.0892 3.7920 4.0203 3.9484 3.9709 3.9551 3.9705 1.0339 1.0277 1.0023 1.0029 1.0145 1.0072 1.0039 0.9999 1.0251 1.0179 1.0174 1.0162 0.9991 1.0104 1.0232 1.0049 0.9998 0.9997 1.0003
dispcorr: -0.028749606 hartree
energy: -1928.189168473763
dipole: -23.40644 23.69854 0.29210 -11.36942 10.64409 -0.72533 -16.03102 15.99146 -0.03955
magnitude: 0.78294 au
magnitude: 1.99006 debye
