program: Orca
programVersion: 5.0.2
elementType: Cl F F F O O O N C C C C C C C C C C C C C C C C C C C C C C C H H H H H H H H H H H H H H H H H H H
charge: 0
multiplicity: 1
keywords: wb97x-d3
keywords: def2-TZVPP
keywords: def2/J RIJCOSX
keywords: DEFGRID2
keywords: scfconv7
keywords: smallprint printgap noloewdin
keywords: NOSOSCF
formula: C23H19ClF3NO3
InChI: InChI=1/C23H19ClF3NO3/c1-22(2)17(12-19(24)23(25,26)27)20(22)21(29)31-18(13-28)14-7-6-10-16(11-14)30-15-8-4-3-5-9-15/h3-12,17-18,20H,1-2H3
50 atoms
Cl 2.724954 -4.994275 -1.686687
F  5.544081 -2.599186 -0.515213
F  5.255744 -3.498338 -2.451206
F  5.538145 -4.741953 -0.722782
O  -0.702874 0.255634 -0.718994
O  -1.361839 -1.876478 -0.926061
O  -3.741074 3.662828 2.157145
N  -1.286953 2.778552 -2.792455
C  0.770519 -2.359174 1.308564
C  1.371093 -2.696373 -0.027034
C  0.695752 -1.353198 0.180692
C  -0.449408 -3.135913 1.741899
C  1.670893 -1.992501 2.464837
C  2.82007 -2.724248 -0.244909
C  -0.562297 -1.068239 -0.540912
C  3.483848 -3.644958 -0.933689
C  -1.910849 0.706064 -1.330042
C  4.966843 -3.618421 -1.155021
C  -2.942366 1.046705 -0.283642
C  -1.546869 1.867512 -2.143432
C  -2.834678 2.235478 0.429705
C  -3.960797 0.146815 -0.010273
C  -3.769653 2.53062 1.411173
C  -4.882027 0.448251 0.984062
C  -4.795758 1.632243 1.691343
C  -2.958345 4.716714 1.760188
C  -3.258387 5.423452 0.603771
C  -1.890357 5.084563 2.561489
C  -2.472702 6.508844 0.250715
C  -1.11711 6.179748 2.202872
C  -1.401932 6.890664 1.047307
H  0.795959 -3.403789 -0.613477
H  1.350122 -0.495204 0.285483
H  -0.135031 -4.015913 2.304793
H  -1.078314 -2.531073 2.397388
H  -1.05983 -3.474493 0.909489
H  1.101842 -1.458657 3.226641
H  2.084592 -2.8903 2.926144
H  2.504374 -1.352282 2.178423
H  3.404276 -1.920279 0.185096
H  -2.304446 -0.060647 -2.003078
H  -2.033634 2.92995 0.208245
H  -4.032432 -0.781516 -0.560776
H  -5.681833 -0.245698 1.20489
H  -5.517805 1.87475 2.459851
H  -4.096458 5.126786 -0.014141
H  -1.675203 4.521772 3.460381
H  -2.700599 7.058942 -0.652419
H  -0.284808 6.472613 2.829117
H  -0.793297 7.739591 0.767118
totalener: -1928.16632507 hartree
nucrepener: 3053.60393665 hartree
electener: -4981.77026172 hartree
oneelecener: -8714.07964848 hartree
twoeener: 3732.30938676 hartree
kineticenergy: 1921.67684249 hartree
xcener: -157.119609403191 hartree
chargesum: -0.0000000
charge: -0.047898 -0.169899 -0.158463 -0.159515 -0.260464 -0.381466 -0.294285 -0.002720 0.060825 0.035076 -0.103241 -0.248780 -0.239252 -0.151857 0.366481 -0.076957 0.319885 0.506303 -0.005754 -0.262693 -0.178055 -0.152723 0.233142 -0.086304 -0.202988 0.214842 -0.155038 -0.175404 -0.107790 -0.111264 -0.123614 0.090925 0.083757 0.092210 0.089737 0.103083 0.096672 0.100607 0.074036 0.116771 0.124554 0.124422 0.124393 0.128507 0.128771 0.132505 0.124461 0.129370 0.126803 0.128286
qa: -0.0479 -0.1699 -0.1585 -0.1595 -0.2605 -0.3815 -0.2943 -0.0027 0.0608 0.0351 -0.1032 -0.2488 -0.2393 -0.1519 0.3665 -0.0770 0.3199 0.5063 -0.0058 -0.2627 -0.1781 -0.1527 0.2331 -0.0863 -0.2030 0.2148 -0.1550 -0.1754 -0.1078 -0.1113 -0.1236 0.0909 0.0838 0.0922 0.0897 0.1031 0.0967 0.1006 0.0740 0.1168 0.1246 0.1244 0.1244 0.1285 0.1288 0.1325 0.1245 0.1294 0.1268 0.1283
va: 1.2878 1.1333 1.1475 1.1464 2.1356 2.1205 2.1181 3.1134 3.7713 3.8038 3.8911 3.9160 3.9092 3.8874 4.2269 4.0648 3.8224 4.4831 3.7258 4.0338 3.9830 3.9773 3.8615 3.9499 4.0336 3.8253 3.9866 4.0290 3.9519 3.9408 3.9503 1.0502 1.0369 1.0013 1.0021 1.0214 1.0039 1.0024 1.0106 1.0279 1.0213 1.0208 1.0189 0.9993 1.0125 1.0035 1.0114 0.9998 0.9994 0.9998
dispcorr: -0.024234955 hartree
energy: -1928.190560027221
dipole: -37.05486 36.30447 -0.75039 29.81244 -29.66308 0.14936 25.70264 -24.02444 1.67820
magnitude: 1.84439 au
magnitude: 4.68806 debye
