program: Orca
programVersion: 5.0.2
elementType: Cl F F F O O O N C C C C C C C C C C C C C C C C C C C C C C C H H H H H H H H H H H H H H H H H H H
charge: 0
multiplicity: 1
keywords: wb97x-d3
keywords: def2-TZVPP
keywords: def2/J RIJCOSX
keywords: DEFGRID2
keywords: scfconv7
keywords: smallprint printgap noloewdin
keywords: NOSOSCF
formula: C23H19ClF3NO3
InChI: InChI=1/C23H19ClF3NO3/c1-22(2)17(12-19(24)23(25,26)27)20(22)21(29)31-18(13-28)14-7-6-10-16(11-14)30-15-8-4-3-5-9-15/h3-12,17-18,20H,1-2H3
50 atoms
Cl 3.933235 -3.465205 1.267102
F  5.791634 -4.052624 -1.04439
F  4.235182 -4.272474 -2.517324
F  4.320921 -5.601851 -0.824578
O  -1.754708 -1.186492 -0.764007
O  -0.644623 -1.046832 1.179494
O  -2.875483 3.410025 1.892005
N  -4.728235 -2.552652 -1.278922
C  1.685469 -0.232593 -0.750793
C  1.879456 -1.640934 -0.260034
C  0.558059 -1.235422 -0.878777
C  1.629873 0.867084 0.28146
C  2.33438 0.207511 -2.042259
C  2.735758 -2.588955 -0.977771
C  -0.639204 -1.151027 -0.016547
C  3.632798 -3.398079 -0.426587
C  -2.999862 -0.996068 -0.091421
C  4.499429 -4.338645 -1.210417
C  -3.397409 0.459306 -0.140455
C  -3.961874 -1.86739 -0.767516
C  -2.978816 1.295923 0.887131
C  -4.096624 0.980137 -1.221035
C  -3.267007 2.651154 0.833502
C  -4.385106 2.335447 -1.258949
C  -3.976231 3.178495 -0.239391
C  -2.337701 4.648642 1.689639
C  -2.62521 5.621316 2.636472
C  -1.491695 4.930536 0.623969
C  -2.060945 6.88124 2.515343
C  -0.942882 6.19891 0.510531
C  -1.222868 7.179065 1.45089
H  1.859088 -1.750188 0.81808
H  0.3603 -1.581133 -1.887264
H  1.247816 0.535097 1.242854
H  2.63338 1.263151 0.442773
H  1.002393 1.690715 -0.064847
H  1.834943 1.097079 -2.428103
H  3.38291 0.459149 -1.876736
H  2.295356 -0.547995 -2.825929
H  2.634217 -2.634133 -2.054687
H  -2.924176 -1.327862 0.948168
H  -2.427328 0.904419 1.732338
H  -4.431174 0.336114 -2.02406
H  -4.94411 2.741029 -2.091359
H  -4.2150 4.233561 -0.274114
H  -3.282292 5.383291 3.462497
H  -1.256381 4.170346 -0.109834
H  -2.285424 7.636134 3.257154
H  -0.28376 6.417158 -0.319369
H  -0.788598 8.164926 1.356971
totalener: -1928.16568137 hartree
nucrepener: 3058.32189151 hartree
electener: -4986.48757288 hartree
oneelecener: -8723.07271357 hartree
twoeener: 3736.58514069 hartree
kineticenergy: 1921.67079195 hartree
xcener: -157.119176633813 hartree
chargesum: -0.0000000
charge: -0.047024 -0.159862 -0.170066 -0.158350 -0.253643 -0.380438 -0.295216 -0.001041 0.063150 0.037293 -0.097870 -0.250996 -0.239925 -0.156305 0.360888 -0.075833 0.306574 0.506605 0.003615 -0.253283 -0.183565 -0.158626 0.197974 -0.109208 -0.149906 0.253465 -0.209706 -0.164282 -0.089723 -0.120559 -0.143935 0.091884 0.084508 0.104877 0.094364 0.084809 0.094794 0.101826 0.074591 0.117329 0.129157 0.134588 0.124100 0.133360 0.138017 0.127369 0.123524 0.127002 0.126688 0.127012
qa: -0.0470 -0.1599 -0.1701 -0.1584 -0.2536 -0.3804 -0.2952 -0.0010 0.0631 0.0373 -0.0979 -0.2510 -0.2399 -0.1563 0.3609 -0.0758 0.3066 0.5066 0.0036 -0.2533 -0.1836 -0.1586 0.1980 -0.1092 -0.1499 0.2535 -0.2097 -0.1643 -0.0897 -0.1206 -0.1439 0.0919 0.0845 0.1049 0.0944 0.0848 0.0948 0.1018 0.0746 0.1173 0.1292 0.1346 0.1241 0.1334 0.1380 0.1274 0.1235 0.1270 0.1267 0.1270
va: 1.2885 1.1448 1.1327 1.1493 2.1293 2.1193 2.1099 3.1131 3.7715 3.7986 3.8892 3.9190 3.9088 3.8851 4.2361 4.0660 3.8148 4.4817 3.7287 4.0213 4.0022 4.0339 3.8983 3.9571 3.9601 3.7910 4.0337 3.9279 3.9389 3.9576 3.9637 1.0506 1.0358 1.0197 1.0029 1.0021 1.0039 1.0024 1.0108 1.0277 1.0200 1.0300 1.0183 1.0004 1.0013 1.0137 1.0070 0.9986 1.0000 1.0001
dispcorr: -0.024460332 hartree
energy: -1928.190141702911
dipole: -27.49972 27.75922 0.25950 52.65516 -50.24671 2.40845 0.11673 -0.49649 -0.37976
magnitude: 2.45198 au
magnitude: 6.23243 debye
