program: Orca
programVersion: 5.0.2
elementType: Cl F F F O O O N C C C C C C C C C C C C C C C C C C C C C C C H H H H H H H H H H H H H H H H H H H
charge: 0
multiplicity: 1
keywords: wb97x-d3
keywords: def2-TZVPP
keywords: def2/J RIJCOSX
keywords: DEFGRID2
keywords: scfconv7
keywords: smallprint printgap noloewdin
keywords: NOSOSCF
formula: C23H19ClF3NO3
InChI: InChI=1/C23H19ClF3NO3/c1-22(2)17(12-19(24)23(25,26)27)20(22)21(29)31-18(13-28)14-7-6-10-16(11-14)30-15-8-4-3-5-9-15/h3-12,17-18,20H,1-2H3
50 atoms
Cl 3.027846 -4.671395 1.05624
F  5.414431 -5.09546 -0.746936
F  4.480885 -4.316681 -2.524327
F  3.659719 -6.045576 -1.539789
O  -1.103861 -0.472921 -1.272161
O  -0.647957 -1.144721 0.817892
O  -2.713525 3.275329 2.275204
N  -3.832268 -1.192519 -2.996386
C  2.276596 -0.413274 -0.050016
C  2.073852 -1.90195 -0.079496
C  1.101456 -0.993588 -0.806489
C  2.074453 0.292999 1.268568
C  3.360944 0.216305 -0.892511
C  2.927064 -2.792227 -0.869678
C  -0.282417 -0.893619 -0.297828
C  3.376312 -3.980039 -0.481947
C  -2.482931 -0.298215 -0.945855
C  4.238866 -4.86414 -1.331662
C  -2.774051 1.151547 -0.644494
C  -3.231966 -0.798378 -2.100162
C  -2.635714 1.593229 0.66327
C  -3.118894 2.043938 -1.65248
C  -2.848657 2.93279 0.968571
C  -3.335787 3.373134 -1.334192
C  -3.205832 3.829454 -0.031398
C  -2.68014 4.600513 2.621962
C  -3.750548 5.132519 3.321555
C  -1.575736 5.381065 2.309592
C  -3.711868 6.462365 3.71567
C  -1.551508 6.709898 2.701624
C  -2.618264 7.255089 3.402777
H  1.689965 -2.322278 0.842675
H  1.183181 -0.953791 -1.886875
H  3.021327 0.329735 1.809182
H  1.745188 1.320998 1.107445
H  1.345909 -0.196605 1.90904
H  3.459974 -0.234477 -1.879199
H  3.14944 1.275639 -1.042973
H  4.327659 0.13671 -0.393347
H  3.211369 -2.461615 -1.860835
H  -2.747766 -0.917095 -0.083702
H  -2.362422 0.906184 1.454365
H  -3.233869 1.707197 -2.674393
H  -3.618542 4.070964 -2.110716
H  -3.390917 4.87076 0.194472
H  -4.599995 4.505903 3.559529
H  -0.74332 4.949833 1.768244
H  -4.544838 6.879515 4.265648
H  -0.691989 7.321197 2.460528
H  -2.59363 8.292193 3.708595
totalener: -1928.16614382 hartree
nucrepener: 3023.14295937 hartree
electener: -4951.30910319 hartree
oneelecener: -8652.95030972 hartree
twoeener: 3701.64120653 hartree
kineticenergy: 1921.68312968 hartree
xcener: -157.121081645492 hartree
chargesum: -0.0000000
charge: -0.047464 -0.159940 -0.170190 -0.158166 -0.253557 -0.383202 -0.290878 -0.003037 0.059314 0.035338 -0.098254 -0.250400 -0.240914 -0.152962 0.367918 -0.076354 0.304859 0.506445 -0.003800 -0.250505 -0.176933 -0.165391 0.221902 -0.127247 -0.156198 0.198437 -0.158547 -0.151190 -0.115708 -0.122134 -0.120136 0.090213 0.084828 0.092389 0.088332 0.105013 0.074551 0.095543 0.100787 0.116483 0.127480 0.131458 0.123336 0.130977 0.131480 0.127677 0.130556 0.129318 0.129234 0.129237
qa: -0.0475 -0.1599 -0.1702 -0.1582 -0.2536 -0.3832 -0.2909 -0.0030 0.0593 0.0353 -0.0983 -0.2504 -0.2409 -0.1530 0.3679 -0.0764 0.3049 0.5064 -0.0038 -0.2505 -0.1769 -0.1654 0.2219 -0.1272 -0.1562 0.1984 -0.1585 -0.1512 -0.1157 -0.1221 -0.1201 0.0902 0.0848 0.0924 0.0883 0.1050 0.0746 0.0955 0.1008 0.1165 0.1275 0.1315 0.1233 0.1310 0.1315 0.1277 0.1306 0.1293 0.1292 0.1292
va: 1.2879 1.1450 1.1329 1.1487 2.1290 2.1188 2.1132 3.1132 3.7773 3.7996 3.8843 3.9168 3.9095 3.8911 4.2268 4.0671 3.8176 4.4824 3.7667 4.0201 4.0091 4.0334 3.8979 3.9933 3.9338 3.8390 4.0206 3.9775 3.9419 3.9417 3.9406 1.0521 1.0358 1.0020 1.0021 1.0200 1.0111 1.0038 1.0024 1.0285 1.0215 1.0316 1.0188 1.0016 1.0086 1.0103 1.0038 0.9991 0.9995 0.9996
dispcorr: -0.023838518 hartree
energy: -1928.189982334077
dipole: -22.18626 22.63226 0.44600 57.67517 -55.02970 2.64547 11.73515 -11.02711 0.70804
magnitude: 2.77466 au
magnitude: 7.05264 debye
