program: Orca
programVersion: 5.0.2
elementType: Cl F F F O O O N C C C C C C C C C C C C C C C C C C C C C C C H H H H H H H H H H H H H H H H H H H
charge: 0
multiplicity: 1
keywords: wb97x-d3
keywords: def2-TZVPP
keywords: def2/J RIJCOSX
keywords: DEFGRID2
keywords: scfconv7
keywords: smallprint printgap noloewdin
keywords: NOSOSCF
formula: C23H19ClF3NO3
InChI: InChI=1/C23H19ClF3NO3/c1-22(2)17(12-19(24)23(25,26)27)20(22)21(29)31-18(13-28)14-7-6-10-16(11-14)30-15-8-4-3-5-9-15/h3-12,17-18,20H,1-2H3
50 atoms
Cl 2.001151 -5.470279 -1.466877
F  5.009969 -5.424287 -1.659433
F  5.180945 -3.286754 -1.876627
F  4.128692 -4.447272 -3.355099
O  -0.602201 -0.118326 -0.987698
O  -1.340985 -1.964652 0.045442
O  -2.296926 4.577281 0.617915
N  -1.716625 1.294597 -3.766442
C  1.47098 -1.991968 1.398174
C  1.550185 -2.806875 0.140815
C  0.985696 -1.393159 0.099629
C  0.499787 -2.448867 2.460406
C  2.722825 -1.37608 1.978724
C  2.802394 -3.060246 -0.572266
C  -0.440534 -1.227296 -0.24833
C  3.082906 -4.14317 -1.287725
C  -1.927394 0.205361 -1.401163
C  4.361556 -4.326384 -2.048089
C  -2.578769 1.13053 -0.405441
C  -1.795095 0.817284 -2.724816
C  -2.16784 2.45193 -0.321712
C  -3.541729 0.636668 0.464941
C  -2.73204 3.292415 0.627825
C  -4.100497 1.485727 1.406213
C  -3.707328 2.811788 1.495688
C  -2.562417 5.395846 1.68278
C  -1.997579 5.147853 2.926438
C  -3.365854 6.50493 1.476535
C  -2.248787 6.022324 3.971609
C  -3.602774 7.378229 2.528386
C  -3.050815 7.138489 3.777404
H  0.802224 -3.587169 0.062292
H  1.63318 -0.637385 -0.330032
H  0.139473 -1.600228 3.043921
H  -0.364406 -2.966648 2.054778
H  1.009096 -3.129256 3.144455
H  3.287961 -2.11826 2.544321
H  3.38822 -0.953816 1.226448
H  2.458529 -0.567866 2.661779
H  3.558887 -2.286659 -0.537468
H  -2.526075 -0.703419 -1.511513
H  -1.419766 2.849272 -0.997485
H  -3.846122 -0.399967 0.411698
H  -4.858803 1.113902 2.081967
H  -4.164527 3.460824 2.230318
H  -1.363524 4.282531 3.071999
H  -3.791914 6.682324 0.497892
H  -1.808403 5.833209 4.941541
H  -4.22611 8.24786 2.368272
H  -3.239728 7.820632 4.59511
totalener: -1928.16521545 hartree
nucrepener: 3012.63902902 hartree
electener: -4940.80424447 hartree
oneelecener: -8632.01666941 hartree
twoeener: 3691.21242493 hartree
kineticenergy: 1921.69359831 hartree
xcener: -157.122252972484 hartree
chargesum: 0.0000000
charge: -0.047416 -0.159855 -0.170091 -0.157991 -0.260081 -0.383185 -0.289486 -0.000757 0.066503 0.018482 -0.097128 -0.244363 -0.246151 -0.144431 0.368920 -0.078564 0.323605 0.506245 0.001031 -0.259797 -0.201509 -0.128653 0.220936 -0.126402 -0.157547 0.204960 -0.157458 -0.168996 -0.119547 -0.109708 -0.124346 0.091477 0.084817 0.088343 0.103719 0.090225 0.100990 0.076240 0.094607 0.116263 0.121017 0.120486 0.121977 0.130468 0.134148 0.131635 0.129542 0.129223 0.128793 0.128814
qa: -0.0474 -0.1599 -0.1701 -0.1580 -0.2601 -0.3832 -0.2895 -0.0008 0.0665 0.0185 -0.0971 -0.2444 -0.2462 -0.1444 0.3689 -0.0786 0.3236 0.5062 0.0010 -0.2598 -0.2015 -0.1287 0.2209 -0.1264 -0.1575 0.2050 -0.1575 -0.1690 -0.1195 -0.1097 -0.1243 0.0915 0.0848 0.0883 0.1037 0.0902 0.1010 0.0762 0.0946 0.1163 0.1210 0.1205 0.1220 0.1305 0.1341 0.1316 0.1295 0.1292 0.1288 0.1288
va: 1.2886 1.1468 1.1325 1.1478 2.1374 2.1179 2.1152 3.1143 3.7638 3.8221 3.8798 3.9140 3.9133 3.8957 4.2202 4.0731 3.8202 4.4808 3.7209 4.0293 4.1097 3.9723 3.8960 3.9843 3.9288 3.8301 3.9769 4.0270 3.9410 3.9384 3.9450 1.0503 1.0364 1.0023 1.0223 1.0009 1.0019 1.0107 1.0039 1.0298 1.0213 1.0299 1.0185 1.0012 1.0067 1.0035 1.0107 0.9995 0.9991 0.9997
dispcorr: -0.023544582 hartree
energy: -1928.188760033695
dipole: -29.40964 28.91733 -0.49231 40.58661 -39.69694 0.88967 37.92976 -35.26401 2.66575
magnitude: 2.85309 au
magnitude: 7.25198 debye
