program: Orca
programVersion: 5.0.2
elementType: Cl F F F O O O N C C C C C C C C C C C C C C C C C C C C C C C H H H H H H H H H H H H H H H H H H H
charge: 0
multiplicity: 1
keywords: wb97x-d3
keywords: def2-TZVPP
keywords: def2/J RIJCOSX
keywords: DEFGRID2
keywords: scfconv7
keywords: smallprint printgap noloewdin
keywords: NOSOSCF
formula: C23H19ClF3NO3
InChI: InChI=1/C23H19ClF3NO3/c1-22(2)17(12-19(24)23(25,26)27)20(22)21(29)31-18(13-28)14-7-6-10-16(11-14)30-15-8-4-3-5-9-15/h3-12,17-18,20H,1-2H3
50 atoms
Cl 2.638165 -4.568719 0.253973
F  5.534358 -4.016072 -0.316825
F  5.190622 -2.505719 -1.81323
F  4.480423 -4.516054 -2.120644
O  -1.387667 -0.000817 -1.495559
O  -1.436406 -1.647885 0.017535
O  -3.521594 3.745804 1.368818
N  -3.421958 1.06414 -3.875677
C  1.332754 -0.318043 0.770784
C  1.531686 -1.641756 0.0851
C  0.641093 -0.591924 -0.546409
C  0.552698 -0.316571 2.063079
C  2.416733 0.732507 0.737833
C  2.794751 -2.00788 -0.562389
C  -0.815324 -0.838545 -0.611493
C  3.347308 -3.21605 -0.542177
C  -2.800136 -0.085064 -1.612433
C  4.647958 -3.562103 -1.204586
C  -3.520444 0.588024 -0.467074
C  -3.130319 0.565214 -2.883026
C  -3.131123 1.855083 -0.054794
C  -4.59282 -0.049227 0.138533
C  -3.829198 2.480227 0.968995
C  -5.289735 0.591513 1.150789
C  -4.909031 1.853469 1.574726
C  -2.235305 4.053234 1.705052
C  -1.420706 3.170371 2.40301
C  -1.778782 5.320883 1.37336
C  -0.143566 3.569806 2.767695
C  -0.502521 5.707691 1.749663
C  0.322925 4.83526 2.443992
H  0.989746 -2.46369 0.538084
H  1.040406 -0.048949 -1.395809
H  1.239197 -0.429031 2.903401
H  0.025904 0.630762 2.187298
H  -0.178502 -1.118701 2.122641
H  2.92612 0.798029 -0.223009
H  1.986278 1.714727 0.940139
H  3.170732 0.532526 1.500671
H  3.327499 -1.232808 -1.0993
H  -3.119344 -1.130725 -1.677639
H  -2.30191 2.362929 -0.533378
H  -4.883327 -1.043033 -0.176452
H  -6.12783 0.098331 1.624036
H  -5.444033 2.36038 2.366829
H  -1.784606 2.18766 2.676233
H  -2.427718 5.996022 0.831187
H  0.485909 2.886771 3.323874
H  -0.15131 6.69834 1.493027
H  1.317385 5.141758 2.7382
totalener: -1928.16457160 hartree
nucrepener: 3145.06273221 hartree
electener: -5073.22730380 hartree
oneelecener: -8896.43206465 hartree
twoeener: 3823.20476084 hartree
kineticenergy: 1921.66911635 hartree
xcener: -157.118593216075 hartree
chargesum: 0.0000000
charge: -0.047756 -0.159889 -0.169569 -0.158465 -0.267646 -0.357882 -0.298511 0.002939 0.089425 0.019376 -0.073534 -0.237486 -0.253415 -0.150962 0.320515 -0.074860 0.312658 0.505841 0.047120 -0.255554 -0.148017 -0.137057 0.164784 -0.096957 -0.179891 0.211923 -0.120302 -0.198156 -0.167201 -0.090076 -0.138574 0.089471 0.086399 0.097838 0.044843 0.108641 0.075788 0.096554 0.100936 0.116264 0.125392 0.133195 0.108376 0.129425 0.132311 0.138641 0.129465 0.137505 0.128157 0.127977
qa: -0.0478 -0.1599 -0.1696 -0.1585 -0.2676 -0.3579 -0.2985 0.0029 0.0894 0.0194 -0.0735 -0.2375 -0.2534 -0.1510 0.3205 -0.0749 0.3127 0.5058 0.0471 -0.2556 -0.1480 -0.1371 0.1648 -0.0970 -0.1799 0.2119 -0.1203 -0.1982 -0.1672 -0.0901 -0.1386 0.0895 0.0864 0.0978 0.0448 0.1086 0.0758 0.0966 0.1009 0.1163 0.1254 0.1332 0.1084 0.1294 0.1323 0.1386 0.1295 0.1375 0.1282 0.1280
va: 1.2886 1.1455 1.1340 1.1480 2.1252 2.1479 2.1047 3.1188 3.7309 3.8330 3.8554 3.9095 3.9182 3.8983 4.2811 4.0657 3.8367 4.4834 3.6427 4.0218 3.9464 4.0244 3.8862 3.9547 4.0361 3.8477 3.8705 4.0282 3.9309 3.9489 3.9600 1.0541 1.0345 1.0028 1.0251 1.0245 1.0128 1.0055 1.0009 1.0287 1.0186 1.0209 1.0131 0.9999 1.0094 0.9991 1.0128 0.9943 0.9978 1.0001
dispcorr: -0.026797724 hartree
energy: -1928.191369320676
dipole: -26.32333 26.37489 0.05156 39.66668 -38.89645 0.77024 21.55164 -19.97789 1.57374
magnitude: 1.75288 au
magnitude: 4.45547 debye
