program: Orca
programVersion: 5.0.2
elementType: Cl F F F O O O N C C C C C C C C C C C C C C C C C C C C C C C H H H H H H H H H H H H H H H H H H H
charge: 0
multiplicity: 1
keywords: wb97x-d3
keywords: def2-TZVPP
keywords: def2/J RIJCOSX
keywords: DEFGRID2
keywords: scfconv7
keywords: smallprint printgap noloewdin
keywords: NOSOSCF
formula: C23H19ClF3NO3
InChI: InChI=1/C23H19ClF3NO3/c1-22(2)17(12-19(24)23(25,26)27)20(22)21(29)31-18(13-28)14-7-6-10-16(11-14)30-15-8-4-3-5-9-15/h3-12,17-18,20H,1-2H3
50 atoms
Cl 3.27463 -4.857994 0.225631
F  3.971423 -5.439667 -2.624794
F  5.63598 -4.48473 -1.656634
F  4.516854 -3.426451 -3.160296
O  -1.182988 -0.455233 -0.960887
O  -0.730464 -1.496973 0.975042
O  -2.972577 3.28187 2.335331
N  -3.767955 -1.601638 -2.702249
C  2.191528 -0.589511 0.400008
C  2.024079 -1.993379 -0.108538
C  1.040941 -0.914846 -0.526229
C  1.964299 -0.347945 1.872787
C  3.279424 0.287403 -0.175334
C  2.917498 -2.557172 -1.12421
C  -0.356442 -1.007378 -0.054915
C  3.491189 -3.75339 -1.076706
C  -2.581948 -0.451673 -0.678737
C  4.409322 -4.279038 -2.139507
C  -3.047132 0.963606 -0.440137
C  -3.242213 -1.090095 -1.818532
C  -2.818777 1.513785 0.815114
C  -3.635145 1.725418 -1.439891
C  -3.185166 2.826546 1.072886
C  -4.004221 3.034034 -1.168031
C  -3.787619 3.593088 0.079798
C  -2.751582 4.613885 2.553663
C  -1.797191 5.320863 1.83278
C  -3.474167 5.230374 3.562863
C  -1.57857 6.657452 2.12592
C  -3.236738 6.565569 3.854058
C  -2.295097 7.28564 3.134858
H  1.643761 -2.696161 0.623783
H  1.141882 -0.540235 -1.538543
H  1.248762 -1.03505 2.3150
H  2.90941 -0.460982 2.405638
H  1.607386 0.668553 2.046728
H  4.242719 0.043058 0.274467
H  3.385005 0.194485 -1.255373
H  3.068312 1.335525 0.039121
H  3.130645 -1.947469 -1.993163
H  -2.786816 -1.062057 0.205488
H  -2.362018 0.926156 1.603208
H  -3.81932 1.306464 -2.420421
H  -4.475898 3.628372 -1.939157
H  -4.092906 4.612198 0.277456
H  -1.22818 4.832639 1.051746
H  -4.210285 4.662576 4.116617
H  -0.836207 7.208929 1.564225
H  -3.799023 7.044946 4.644324
H  -2.117077 8.328135 3.360846
totalener: -1928.16543014 hartree
nucrepener: 3015.64860305 hartree
electener: -4943.81403319 hartree
oneelecener: -8637.84342656 hartree
twoeener: 3694.02939337 hartree
kineticenergy: 1921.67054885 hartree
xcener: -157.118842698770 hartree
chargesum: 0.0000000
charge: -0.046782 -0.157634 -0.160124 -0.169774 -0.257036 -0.378276 -0.294645 -0.001515 0.065561 0.034240 -0.117993 -0.250123 -0.234967 -0.152468 0.372389 -0.077195 0.303573 0.506893 0.000681 -0.254123 -0.176677 -0.163258 0.194706 -0.110345 -0.152214 0.230677 -0.163932 -0.195517 -0.115226 -0.097050 -0.136730 0.092964 0.083467 0.105423 0.091228 0.088695 0.101839 0.073533 0.094795 0.117245 0.133061 0.131948 0.126508 0.132861 0.135726 0.132626 0.128119 0.128670 0.128105 0.128068
qa: -0.0468 -0.1576 -0.1601 -0.1698 -0.2570 -0.3783 -0.2946 -0.0015 0.0656 0.0342 -0.1180 -0.2501 -0.2350 -0.1525 0.3724 -0.0772 0.3036 0.5069 0.0007 -0.2541 -0.1767 -0.1633 0.1947 -0.1103 -0.1522 0.2307 -0.1639 -0.1955 -0.1152 -0.0970 -0.1367 0.0930 0.0835 0.1054 0.0912 0.0887 0.1018 0.0735 0.0948 0.1172 0.1331 0.1319 0.1265 0.1329 0.1357 0.1326 0.1281 0.1287 0.1281 0.1281
va: 1.2888 1.1506 1.1441 1.1333 2.1244 2.1238 2.1102 3.1136 3.7588 3.8030 3.9047 3.9154 3.9097 3.8838 4.2089 4.0645 3.8086 4.4822 3.7997 4.0305 4.0157 4.0222 3.8997 3.9763 3.9411 3.8072 3.9540 4.0365 3.9445 3.9367 3.9562 1.0482 1.0380 1.0212 1.0016 1.0020 1.0024 1.0106 1.0043 1.0273 1.0273 1.0276 1.0205 1.0008 1.0036 1.0029 1.0127 0.9997 0.9987 0.9999
dispcorr: -0.023548906 hartree
energy: -1928.188979044155
dipole: -24.47519 24.77516 0.29997 53.59130 -50.98676 2.60454 20.77923 -19.87416 0.90507
magnitude: 2.77358 au
magnitude: 7.04987 debye
