program: Orca
programVersion: 5.0.2
elementType: Cl F F F O O O N C C C C C C C C C C C C C C C C C C C C C C C H H H H H H H H H H H H H H H H H H H
charge: 0
multiplicity: 1
keywords: wb97x-d3
keywords: def2-TZVPP
keywords: def2/J RIJCOSX
keywords: DEFGRID2
keywords: scfconv7
keywords: smallprint printgap noloewdin
keywords: NOSOSCF
formula: C23H19ClF3NO3
InChI: InChI=1/C23H19ClF3NO3/c1-22(2)17(12-19(24)23(25,26)27)20(22)21(29)31-18(13-28)14-7-6-10-16(11-14)30-15-8-4-3-5-9-15/h3-12,17-18,20H,1-2H3
50 atoms
Cl 2.789813 -4.440103 0.578477
F  5.645925 -3.905622 -0.075807
F  5.286487 -2.475329 -1.645802
F  4.616908 -4.51304 -1.857739
O  -1.371483 -0.01715 -1.493013
O  -1.388806 -1.635646 0.050233
O  -3.477221 3.801099 1.302832
N  -3.438612 0.935365 -3.894038
C  1.375536 -0.234843 0.723961
C  1.574135 -1.593026 0.108731
C  0.675063 -0.584582 -0.570502
C  0.612409 -0.173114 2.023416
C  2.459214 0.811335 0.621868
C  2.845591 -1.978277 -0.507573
C  -0.781369 -0.837019 -0.605039
C  3.447186 -3.153298 -0.357427
C  -2.784575 -0.111709 -1.591101
C  4.758736 -3.5110 -0.991755
C  -3.498728 0.600888 -0.465595
C  -3.131596 0.486247 -2.882613
C  -3.094678 1.873156 -0.083341
C  -4.583562 -0.007282 0.146751
C  -3.791543 2.533505 0.919628
C  -5.279856 0.669414 1.13639
C  -4.885845 1.935882 1.531015
C  -2.167251 4.151101 1.467245
C  -1.75898 5.376305 0.962143
C  -1.279427 3.344294 2.167943
C  -0.452674 5.796309 1.162011
C  0.025219 3.774181 2.355202
C  0.445825 4.997615 1.853356
H  1.041491 -2.391723 0.611332
H  1.062577 -0.083678 -1.45074
H  -0.135464 -0.956546 2.117918
H  1.306808 -0.274726 2.859046
H  0.107673 0.789012 2.123822
H  2.941899 0.837104 -0.354305
H  2.035103 1.801823 0.794925
H  3.23432 0.641116 1.371021
H  3.346868 -1.243611 -1.125847
H  -3.098929 -1.160565 -1.611431
H  -2.254103 2.354256 -0.569264
H  -4.884757 -1.005114 -0.144468
H  -6.12833 0.200477 1.615852
H  -5.419997 2.469595 2.305936
H  -2.46537 5.993619 0.42314
H  -1.608482 2.397066 2.577054
H  -0.137017 6.753624 0.769236
H  0.713873 3.151886 2.912445
H  1.463456 5.329296 2.007885
totalener: -1928.16447335 hartree
nucrepener: 3148.78553782 hartree
electener: -5076.95001117 hartree
oneelecener: -8903.86118473 hartree
twoeener: 3826.91117356 hartree
kineticenergy: 1921.68337557 hartree
xcener: -157.121713256120 hartree
chargesum: -0.0000000
charge: -0.047475 -0.160890 -0.169273 -0.157930 -0.267852 -0.357251 -0.298618 0.002953 0.091155 0.023134 -0.079551 -0.237894 -0.251571 -0.153579 0.319892 -0.073638 0.308617 0.506194 0.052715 -0.255710 -0.149838 -0.146613 0.174371 -0.092768 -0.187423 0.211466 -0.195028 -0.125050 -0.091909 -0.166950 -0.135113 0.088542 0.086133 0.107700 0.099505 0.044117 0.075742 0.093789 0.102545 0.116580 0.126176 0.132891 0.107670 0.128802 0.131737 0.130292 0.140549 0.128716 0.140750 0.129191
qa: -0.0475 -0.1609 -0.1693 -0.1579 -0.2679 -0.3573 -0.2986 0.0030 0.0912 0.0231 -0.0796 -0.2379 -0.2516 -0.1536 0.3199 -0.0736 0.3086 0.5062 0.0527 -0.2557 -0.1498 -0.1466 0.1744 -0.0928 -0.1874 0.2115 -0.1950 -0.1251 -0.0919 -0.1669 -0.1351 0.0885 0.0861 0.1077 0.0995 0.0441 0.0757 0.0938 0.1025 0.1166 0.1262 0.1329 0.1077 0.1288 0.1317 0.1303 0.1405 0.1287 0.1408 0.1292
va: 1.2888 1.1448 1.1340 1.1480 2.1241 2.1482 2.1073 3.1196 3.7298 3.8297 3.8640 3.9085 3.9159 3.8981 4.2863 4.0626 3.8378 4.4833 3.6552 4.0215 3.9215 4.0312 3.8750 3.9577 4.0357 3.8507 4.0334 3.8924 3.9460 3.9285 3.9620 1.0548 1.0348 1.0245 1.0024 1.0249 1.0132 1.0084 1.0002 1.0283 1.0193 1.0210 1.0130 0.9998 1.0102 1.0122 0.9976 0.9980 0.9916 1.0001
dispcorr: -0.026954370 hartree
energy: -1928.191427720764
dipole: -26.77373 26.85266 0.07893 40.13585 -39.24248 0.89337 17.99074 -16.53818 1.45256
magnitude: 1.70712 au
magnitude: 4.33916 debye
