program: Orca
programVersion: 5.0.2
elementType: Cl F F F O O O N C C C C C C C C C C C C C C C C C C C C C C C H H H H H H H H H H H H H H H H H H H
charge: 0
multiplicity: 1
keywords: wb97x-d3
keywords: def2-TZVPP
keywords: def2/J RIJCOSX
keywords: DEFGRID2
keywords: scfconv7
keywords: smallprint printgap noloewdin
keywords: NOSOSCF
formula: C23H19ClF3NO3
InChI: InChI=1/C23H19ClF3NO3/c1-22(2)17(12-19(24)23(25,26)27)20(22)21(29)31-18(13-28)14-7-6-10-16(11-14)30-15-8-4-3-5-9-15/h3-12,17-18,20H,1-2H3
50 atoms
Cl 3.00203 -0.331735 2.1580
F  4.814287 -3.630246 1.211471
F  4.391727 -2.846194 3.174483
F  5.61798 -1.725935 1.813992
O  -1.484816 -1.145476 -0.009657
O  -1.990376 -3.280106 -0.420125
O  -2.319031 4.014472 -0.093229
N  -4.23862 -0.96719 -1.974847
C  1.050404 -1.694641 -1.629692
C  1.353123 -1.688536 -0.154699
C  0.254485 -2.583414 -0.701866
C  0.457387 -0.440303 -2.229679
C  1.97527 -2.41039 -2.587352
C  2.559847 -2.315246 0.390652
C  -1.176528 -2.402435 -0.37187
C  3.323375 -1.824785 1.360489
C  -2.855107 -0.862357 0.244452
C  4.545157 -2.513691 1.891601
C  -2.913566 0.52011 0.838729
C  -3.625911 -0.941536 -1.003714
C  -2.607143 1.619164 0.043002
C  -3.221302 0.680147 2.178485
C  -2.600458 2.886697 0.604749
C  -3.223914 1.956701 2.727177
C  -2.912591 3.056429 1.952375
C  -1.808715 3.907416 -1.362027
C  -2.627148 4.199311 -2.440515
C  -0.482088 3.546702 -1.55044
C  -2.106633 4.136054 -3.725294
C  0.02503 3.480763 -2.83894
C  -0.784038 3.772974 -3.928404
H  1.01248 -0.805077 0.37131
H  0.493955 -3.638335 -0.77573
H  -0.243688 -0.682891 -3.030044
H  -0.059154 0.185026 -1.50673
H  1.256665 0.161776 -2.664966
H  2.843201 -1.791426 -2.819159
H  2.339527 -3.363887 -2.20685
H  1.453945 -2.617729 -3.522733
H  2.858542 -3.266179 -0.032251
H  -3.274766 -1.593415 0.942003
H  -2.389661 1.481671 -1.00923
H  -3.45599 -0.178598 2.794183
H  -3.465273 2.093239 3.772649
H  -2.910521 4.051987 2.376084
H  -3.65882 4.478156 -2.271139
H  0.146648 3.327584 -0.696677
H  -2.742516 4.366515 -4.569589
H  1.060143 3.204638 -2.990764
H  -0.383009 3.722548 -4.931599
totalener: -1928.16198932 hartree
nucrepener: 3191.97089320 hartree
electener: -5120.13288252 hartree
oneelecener: -8990.40430948 hartree
twoeener: 3870.27142696 hartree
kineticenergy: 1921.66859228 hartree
xcener: -157.117137841400 hartree
chargesum: -0.0000000
charge: -0.052021 -0.169295 -0.159250 -0.159929 -0.263670 -0.329861 -0.295811 0.003106 0.087038 0.063284 -0.094807 -0.236930 -0.248197 -0.174859 0.329043 -0.071438 0.285107 0.504419 0.056648 -0.254388 -0.203093 -0.169839 0.233166 -0.083154 -0.202887 0.226117 -0.148827 -0.178901 -0.117333 -0.142020 -0.105340 0.089254 0.084357 0.107274 0.057903 0.085255 0.098408 0.074695 0.101075 0.116140 0.113968 0.126297 0.112227 0.128512 0.128432 0.127941 0.132516 0.129961 0.130407 0.129299
qa: -0.0520 -0.1693 -0.1593 -0.1599 -0.2637 -0.3299 -0.2958 0.0031 0.0870 0.0633 -0.0948 -0.2369 -0.2482 -0.1749 0.3290 -0.0714 0.2851 0.5044 0.0566 -0.2544 -0.2031 -0.1698 0.2332 -0.0832 -0.2029 0.2261 -0.1488 -0.1789 -0.1173 -0.1420 -0.1053 0.0893 0.0844 0.1073 0.0579 0.0853 0.0984 0.0747 0.1011 0.1161 0.1140 0.1263 0.1122 0.1285 0.1284 0.1279 0.1325 0.1300 0.1304 0.1293
va: 1.2837 1.1341 1.1462 1.1463 2.1311 2.1732 2.1248 3.1127 3.7461 3.7540 3.8896 3.9205 3.9193 3.8976 4.2810 4.0611 3.8950 4.4843 3.7077 3.9715 3.9716 4.0061 3.8848 3.9644 4.0437 3.8029 4.0259 3.9517 3.9581 3.9147 3.9364 1.0432 1.0336 1.0033 1.0172 1.0056 1.0018 1.0115 1.0025 1.0296 1.0205 1.0169 1.0109 0.9995 1.0130 1.0098 1.0061 0.9992 0.9986 0.9990
dispcorr: -0.026828962 hartree
energy: -1928.188818281162
dipole: -26.97176 27.49212 0.52036 16.88966 -16.00877 0.88089 -29.64580 29.48547 -0.16033
magnitude: 1.03559 au
magnitude: 2.63227 debye
