program: Orca
programVersion: 5.0.2
elementType: Cl F F F O O O N C C C C C C C C C C C C C C C C C C C C C C C H H H H H H H H H H H H H H H H H H H
charge: 0
multiplicity: 1
keywords: wb97x-d3
keywords: def2-TZVPP
keywords: def2/J RIJCOSX
keywords: DEFGRID2
keywords: scfconv7
keywords: smallprint printgap noloewdin
keywords: NOSOSCF
formula: C23H19ClF3NO3
InChI: InChI=1/C23H19ClF3NO3/c1-22(2)17(12-19(24)23(25,26)27)20(22)21(29)31-18(13-28)14-7-6-10-16(11-14)30-15-8-4-3-5-9-15/h3-12,17-18,20H,1-2H3
50 atoms
Cl 2.165483 -2.768095 -2.332365
F  4.598323 -4.51746 -2.37245
F  5.34015 -3.938998 -0.434995
F  5.17661 -2.48333 -2.012099
O  -0.769722 -0.331091 -0.70652
O  -1.442636 -2.359524 -0.038752
O  -3.189212 3.616095 1.879164
N  -1.806452 1.544149 -3.242659
C  1.064997 -2.129312 1.830688
C  1.371378 -2.994511 0.654194
C  0.786877 -1.624379 0.421376
C  -0.066838 -2.514574 2.751983
C  2.205232 -1.440138 2.542373
C  2.758176 -3.286116 0.227769
C  -0.586335 -1.520794 -0.109646
C  3.185881 -3.22518 -1.026524
C  -2.078132 -0.058241 -1.197513
C  4.587221 -3.545115 -1.462629
C  -2.940857 0.558513 -0.124504
C  -1.904065 0.842805 -2.338608
C  -2.647809 1.836101 0.340047
C  -3.986858 -0.169007 0.420674
C  -3.424494 2.390199 1.346855
C  -4.750881 0.393338 1.4338
C  -4.479603 1.667679 1.895741
C  -2.585395 4.594643 1.136593
C  -1.531035 5.280681 1.718192
C  -3.043829 4.93849 -0.128601
C  -0.934205 6.325701 1.028653
C  -2.430609 5.976923 -0.811303
C  -1.376887 6.674401 -0.237939
H  0.674233 -3.811802 0.483189
H  1.465173 -0.857204 0.066207
H  -0.518566 -1.628362 3.20128
H  -0.85331 -3.074174 2.252301
H  0.318324 -3.134277 3.563364
H  2.631575 -2.092531 3.306862
H  3.009941 -1.149294 1.866111
H  1.851884 -0.536749 3.041113
H  3.46157 -3.599002 0.990394
H  -2.547459 -0.9751 -1.566363
H  -1.824144 2.395767 -0.087128
H  -4.197767 -1.169055 0.066561
H  -5.570649 -0.166076 1.863756
H  -5.075715 2.11384 2.6808
H  -1.190611 5.000072 2.706217
H  -3.871143 4.403907 -0.577722
H  -0.113912 6.864153 1.484371
H  -2.784507 6.24265 -1.798364
H  -0.905861 7.485561 -0.776036
totalener: -1928.16342974 hartree
nucrepener: 3120.81678788 hartree
electener: -5048.98021762 hartree
oneelecener: -8848.71374288 hartree
twoeener: 3799.73352525 hartree
kineticenergy: 1921.67617245 hartree
xcener: -157.118706549941 hartree
chargesum: -0.0000000
charge: -0.037094 -0.157965 -0.168159 -0.158781 -0.259038 -0.381989 -0.296494 -0.001559 0.102104 -0.031979 -0.156381 -0.253559 -0.266351 -0.179960 0.380067 -0.032941 0.333154 0.499280 0.008473 -0.265888 -0.189647 -0.141976 0.226797 -0.085507 -0.208095 0.243807 -0.206753 -0.169959 -0.091862 -0.100582 -0.140560 0.111744 0.108712 0.093213 0.102691 0.087966 0.095031 0.087862 0.098484 0.137250 0.120236 0.129288 0.117951 0.128990 0.129695 0.123701 0.133858 0.126012 0.129925 0.126789
qa: -0.0371 -0.1580 -0.1682 -0.1588 -0.2590 -0.3820 -0.2965 -0.0016 0.1021 -0.0320 -0.1564 -0.2536 -0.2664 -0.1800 0.3801 -0.0329 0.3332 0.4993 0.0085 -0.2659 -0.1896 -0.1420 0.2268 -0.0855 -0.2081 0.2438 -0.2068 -0.1700 -0.0919 -0.1006 -0.1406 0.1117 0.1087 0.0932 0.1027 0.0880 0.0950 0.0879 0.0985 0.1372 0.1202 0.1293 0.1180 0.1290 0.1297 0.1237 0.1339 0.1260 0.1299 0.1268
va: 1.3039 1.1515 1.1357 1.1475 2.1343 2.1207 2.1158 3.1173 3.7536 3.8398 3.8832 3.9062 3.9120 3.8484 4.1730 4.0122 3.8297 4.4928 3.6773 4.0305 3.9797 3.9848 3.8533 3.9475 4.0376 3.7964 4.0471 3.9669 3.9323 3.9476 3.9632 1.0293 1.0255 1.0010 1.0199 1.0025 1.0018 1.0028 1.0060 1.0130 1.0213 1.0177 1.0191 0.9994 1.0119 1.0138 1.0033 0.9990 0.9996 1.0004
dispcorr: -0.025362549 hartree
energy: -1928.188792287983
dipole: -30.89120 30.58718 -0.30402 26.31905 -26.37886 -0.05981 30.62746 -28.70745 1.92000
magnitude: 1.94484 au
magnitude: 4.94340 debye
