program: Orca
programVersion: 5.0.2
elementType: Cl F F F O O O N C C C C C C C C C C C C C C C C C C C C C C C H H H H H H H H H H H H H H H H H H H
charge: 0
multiplicity: 1
keywords: wb97x-d3
keywords: def2-TZVPP
keywords: def2/J RIJCOSX
keywords: DEFGRID2
keywords: scfconv7
keywords: smallprint printgap noloewdin
keywords: NOSOSCF
formula: C23H19ClF3NO3
InChI: InChI=1/C23H19ClF3NO3/c1-22(2)17(12-19(24)23(25,26)27)20(22)21(29)31-18(13-28)14-7-6-10-16(11-14)30-15-8-4-3-5-9-15/h3-12,17-18,20H,1-2H3
50 atoms
Cl 4.498245 -0.838517 0.369747
F  5.981595 -3.153033 -0.828311
F  4.434301 -4.616253 -0.510283
F  5.351924 -3.627706 1.170497
O  -1.872372 -1.507044 0.602822
O  -0.382365 0.159141 0.712125
O  -3.426498 3.964915 -0.302051
N  -4.711778 -2.291247 2.072644
C  0.645524 -1.462668 -1.818931
C  1.613883 -1.510015 -0.66687
C  0.162595 -1.866542 -0.443238
C  0.297619 -0.107219 -2.386051
C  0.658809 -2.551906 -2.864096
C  2.641411 -2.54914 -0.565142
C  -0.679702 -0.945157 0.350401
C  3.888539 -2.363857 -0.147763
C  -2.849005 -0.671155 1.219868
C  4.919638 -3.450475 -0.078335
C  -3.395677 0.344107 0.244972
C  -3.889531 -1.585564 1.693001
C  -3.15968 1.691301 0.468491
C  -4.078809 -0.077141 -0.889158
C  -3.596242 2.627985 -0.460785
C  -4.522406 0.866659 -1.800634
C  -4.277332 2.215035 -1.59818
C  -2.344811 4.470421 0.36466
C  -2.566635 5.584893 1.160396
C  -1.065078 3.94922 0.219295
C  -1.499773 6.182839 1.812497
C  -0.00997 4.550558 0.887985
C  -0.218916 5.666546 1.684755
H  1.897015 -0.539718 -0.276261
H  -0.088238 -2.915671 -0.331066
H  0.986173 0.13802 -3.195735
H  -0.713492 -0.107257 -2.797329
H  0.359447 0.690613 -1.649852
H  0.817158 -3.546434 -2.448811
H  -0.2951 -2.573979 -3.392514
H  1.442973 -2.370129 -3.600455
H  2.369559 -3.554642 -0.860855
H  -2.424101 -0.16226 2.091205
H  -2.620369 2.004949 1.352841
H  -4.271116 -1.129113 -1.05772
H  -5.060421 0.551261 -2.684381
H  -4.614669 2.954191 -2.312684
H  -3.569453 5.979284 1.258408
H  -0.886493 3.079885 -0.400033
H  -1.675663 7.053223 2.430546
H  0.984576 4.138901 0.779851
H  0.610404 6.130307 2.201135
totalener: -1928.16491327 hartree
nucrepener: 3127.76417716 hartree
electener: -5055.92909042 hartree
oneelecener: -8862.03781536 hartree
twoeener: 3806.10872494 hartree
kineticenergy: 1921.67916544 hartree
xcener: -157.121218021834 hartree
chargesum: 0.0000000
charge: -0.048997 -0.159705 -0.169697 -0.158750 -0.249549 -0.369993 -0.294974 0.001817 0.059766 0.028636 -0.066578 -0.233405 -0.248733 -0.155419 0.326237 -0.071891 0.314084 0.505568 0.025877 -0.259535 -0.164562 -0.207130 0.258121 -0.086848 -0.203319 0.263382 -0.214558 -0.172702 -0.089252 -0.116872 -0.141034 0.088083 0.087060 0.096640 0.092111 0.081111 0.076021 0.096268 0.102381 0.115781 0.118946 0.124489 0.122909 0.130664 0.129735 0.125910 0.131745 0.126634 0.127424 0.126102
qa: -0.0490 -0.1597 -0.1697 -0.1587 -0.2495 -0.3700 -0.2950 0.0018 0.0598 0.0286 -0.0666 -0.2334 -0.2487 -0.1554 0.3262 -0.0719 0.3141 0.5056 0.0259 -0.2595 -0.1646 -0.2071 0.2581 -0.0868 -0.2033 0.2634 -0.2146 -0.1727 -0.0893 -0.1169 -0.1410 0.0881 0.0871 0.0966 0.0921 0.0811 0.0760 0.0963 0.1024 0.1158 0.1189 0.1245 0.1229 0.1307 0.1297 0.1259 0.1317 0.1266 0.1274 0.1261
va: 1.2868 1.1458 1.1334 1.1478 2.1430 2.1324 2.1261 3.1177 3.7964 3.8124 3.8387 3.9133 3.9085 3.8989 4.2854 4.0640 3.8445 4.4831 3.6048 4.0196 3.9398 4.0325 3.8586 3.9291 4.0401 3.7893 4.0375 3.9495 3.9320 3.9604 3.9620 1.0526 1.0332 1.0038 1.0029 1.0214 1.0109 1.0039 1.0018 1.0292 1.0173 1.0162 1.0174 0.9988 1.0121 1.0144 0.9953 0.9988 1.0001 1.0002
dispcorr: -0.025936838 hartree
energy: -1928.190850103445
dipole: -36.62881 36.61099 -0.01781 26.31638 -25.56751 0.74887 -14.18755 12.91479 -1.27276
magnitude: 1.47684 au
magnitude: 3.75382 debye
