program: Orca
programVersion: 5.0.2
elementType: Cl F F F O O O N C C C C C C C C C C C C C C C C C C C C C C C H H H H H H H H H H H H H H H H H H H
charge: 0
multiplicity: 1
keywords: wb97x-d3
keywords: def2-TZVPP
keywords: def2/J RIJCOSX
keywords: DEFGRID2
keywords: scfconv7
keywords: smallprint printgap noloewdin
keywords: NOSOSCF
formula: C23H19ClF3NO3
InChI: InChI=1/C23H19ClF3NO3/c1-22(2)17(12-19(24)23(25,26)27)20(22)21(29)31-18(13-28)14-7-6-10-16(11-14)30-15-8-4-3-5-9-15/h3-12,17-18,20H,1-2H3
50 atoms
Cl 2.613937 -5.224468 -0.995904
F  5.106992 -4.183795 -2.417319
F  5.531687 -4.951455 -0.45798
F  5.667803 -2.835778 -0.833326
O  -0.657792 0.271679 -0.929059
O  -1.222602 -1.864276 -0.565868
O  -3.386159 3.688946 2.167825
N  -1.832249 2.462749 -3.129657
C  1.240112 -1.689828 1.369053
C  1.597884 -2.466873 0.131138
C  0.970033 -1.092362 0.004517
C  0.110696 -2.213554 2.22299
C  2.327255 -1.024416 2.179694
C  2.994873 -2.660631 -0.268139
C  -0.409466 -0.983119 -0.517361
C  3.522337 -3.784418 -0.740643
C  -1.988753 0.548308 -1.359761
C  4.967652 -3.937281 -1.11441
C  -2.869345 0.936377 -0.196759
C  -1.88082 1.624702 -2.346114
C  -2.698547 2.172286 0.417386
C  -3.812986 0.036889 0.27603
C  -3.49825 2.513405 1.499209
C  -4.596149 0.384538 1.367645
C  -4.448206 1.616231 1.977293
C  -2.889225 4.79888 1.538292
C  -1.878124 5.500425 2.175101
C  -3.412445 5.246321 0.331934
C  -1.388205 6.663313 1.599159
C  -2.904769 6.402306 -0.239021
C  -1.893497 7.114974 0.389734
H  0.927128 -3.286866 -0.097101
H  1.622449 -0.274446 -0.279953
H  -0.634995 -2.764212 1.656318
H  0.513557 -2.88521 2.982172
H  -0.393877 -1.3950 2.738964
H  1.900017 -0.236134 2.800334
H  2.809243 -1.745808 2.840873
H  3.10303 -0.565726 1.568092
H  3.665416 -1.817786 -0.157883
H  -2.414111 -0.323026 -1.866503
H  -1.955937 2.867672 0.044537
H  -3.930392 -0.92877 -0.196445
H  -5.336271 -0.309763 1.741893
H  -5.064238 1.8960 2.821683
H  -1.486979 5.138906 3.116984
H  -4.207109 4.699077 -0.158977
H  -0.601371 7.21336 2.09796
H  -3.307273 6.748186 -1.181645
H  -1.504133 8.017636 -0.060936
totalener: -1928.16649975 hartree
nucrepener: 3056.40058171 hartree
electener: -4984.56708146 hartree
oneelecener: -8719.61247428 hartree
twoeener: 3735.04539282 hartree
kineticenergy: 1921.66389151 hartree
xcener: -157.117956711895 hartree
chargesum: -0.0000000
charge: -0.047803 -0.158775 -0.159763 -0.170233 -0.260671 -0.377750 -0.295845 -0.001221 0.057072 0.032781 -0.089708 -0.248601 -0.246150 -0.153678 0.357700 -0.074728 0.328565 0.506068 0.005451 -0.268183 -0.184701 -0.144005 0.226663 -0.088085 -0.204844 0.240929 -0.203172 -0.169643 -0.093966 -0.099250 -0.139245 0.090207 0.085067 0.102535 0.092658 0.091862 0.097205 0.102028 0.075676 0.116287 0.123532 0.128276 0.119957 0.129267 0.129392 0.123762 0.134086 0.126600 0.129455 0.126937
qa: -0.0478 -0.1588 -0.1598 -0.1702 -0.2607 -0.3777 -0.2958 -0.0012 0.0571 0.0328 -0.0897 -0.2486 -0.2461 -0.1537 0.3577 -0.0747 0.3286 0.5061 0.0055 -0.2682 -0.1847 -0.1440 0.2267 -0.0881 -0.2048 0.2409 -0.2032 -0.1696 -0.0940 -0.0992 -0.1392 0.0902 0.0851 0.1025 0.0927 0.0919 0.0972 0.1020 0.0757 0.1163 0.1235 0.1283 0.1200 0.1293 0.1294 0.1238 0.1341 0.1266 0.1295 0.1269
va: 1.2882 1.1469 1.1462 1.1325 2.1387 2.1254 2.1155 3.1162 3.7852 3.8065 3.8793 3.9153 3.9094 3.8899 4.2442 4.0647 3.8237 4.4819 3.6722 4.0307 3.9762 3.9788 3.8563 3.9510 4.0348 3.7974 4.0450 3.9673 3.9321 3.9470 3.9620 1.0518 1.0350 1.0203 1.0018 1.0012 1.0039 1.0020 1.0109 1.0288 1.0187 1.0170 1.0204 0.9992 1.0118 1.0135 1.0029 0.9989 0.9998 1.0003
dispcorr: -0.024447824 hartree
energy: -1928.190947576923
dipole: -34.04851 33.54581 -0.50271 37.43539 -36.96900 0.46640 23.60169 -22.00877 1.59291
magnitude: 1.73425 au
magnitude: 4.40810 debye
