program: Orca
programVersion: 5.0.2
elementType: Cl F F F O O O N C C C C C C C C C C C C C C C C C C C C C C C H H H H H H H H H H H H H H H H H H H
charge: 0
multiplicity: 1
keywords: wb97x-d3
keywords: def2-TZVPP
keywords: def2/J RIJCOSX
keywords: DEFGRID2
keywords: scfconv7
keywords: smallprint printgap noloewdin
keywords: NOSOSCF
formula: C23H19ClF3NO3
InChI: InChI=1/C23H19ClF3NO3/c1-22(2)17(12-19(24)23(25,26)27)20(22)21(29)31-18(13-28)14-7-6-10-16(11-14)30-15-8-4-3-5-9-15/h3-12,17-18,20H,1-2H3
50 atoms
Cl 5.045931 -1.625572 -0.566336
F  4.157453 -5.375538 -0.105732
F  5.338178 -4.102515 1.168435
F  5.959219 -4.464248 -0.854868
O  -0.9366 -0.932933 0.730758
O  0.410525 0.451841 -0.400077
O  -4.008816 4.073614 -0.302466
N  -2.499796 -0.712922 3.636813
C  0.859867 -2.072145 -2.214106
C  1.987441 -1.960607 -1.227935
C  0.546943 -1.918778 -0.743374
C  0.653289 -0.922841 -3.170963
C  0.520753 -3.410927 -2.82715
C  2.813549 -3.105719 -0.83559
C  0.036049 -0.66073 -0.15919
C  4.104948 -3.067033 -0.526937
C  -1.545176 0.176187 1.371733
C  4.894225 -4.262695 -0.07908
C  -2.655714 0.782206 0.545685
C  -2.075779 -0.33973 2.636619
C  -2.784004 2.160886 0.50221
C  -3.556848 -0.034253 -0.125384
C  -3.838593 2.730224 -0.202635
C  -4.586651 0.546804 -0.846887
C  -4.738262 1.923407 -0.884396
C  -3.683173 4.879214 0.754955
C  -4.116826 4.598952 2.044888
C  -2.945852 6.02217 0.48913
C  -3.79828 5.473816 3.07136
C  -2.642312 6.893634 1.524545
C  -3.060903 6.621758 2.818125
H  2.487297 -0.998965 -1.222232
H  0.179128 -2.813758 -0.254487
H  -0.397079 -0.84546 -3.456818
H  0.959162 0.035719 -2.761351
H  1.230967 -1.099487 -4.079323
H  0.575178 -4.238153 -2.120303
H  -0.49557 -3.393652 -3.22282
H  1.195745 -3.635003 -3.654247
H  2.326361 -4.070558 -0.771804
H  -0.79997 0.943566 1.605962
H  -2.065557 2.790344 1.01324
H  -3.463582 -1.111209 -0.083128
H  -5.293529 -0.079468 -1.374345
H  -5.549581 2.37888 -1.436556
H  -4.701081 3.710208 2.24741
H  -2.62021 6.224825 -0.522587
H  -4.136072 5.256667 4.075983
H  -2.068464 7.786888 1.316396
H  -2.818796 7.301589 3.623568
totalener: -1928.16506758 hartree
nucrepener: 3030.68697247 hartree
electener: -4958.85204005 hartree
oneelecener: -8668.07058569 hartree
twoeener: 3709.21854564 hartree
kineticenergy: 1921.66930128 hartree
xcener: -157.118065235131 hartree
chargesum: -0.0000000
charge: -0.047101 -0.170064 -0.158534 -0.159426 -0.270996 -0.364345 -0.297140 0.000889 0.062196 0.027016 -0.089569 -0.242379 -0.244850 -0.148516 0.336434 -0.078433 0.305444 0.506799 0.056241 -0.250186 -0.136829 -0.194422 0.197706 -0.095844 -0.183516 0.222792 -0.156374 -0.200480 -0.114968 -0.093800 -0.139439 0.090856 0.085201 0.088872 0.105009 0.090583 0.075698 0.094670 0.101717 0.115714 0.122697 0.115909 0.124879 0.128670 0.130438 0.136988 0.127410 0.131081 0.127454 0.127844
qa: -0.0471 -0.1701 -0.1585 -0.1594 -0.2710 -0.3643 -0.2971 0.0009 0.0622 0.0270 -0.0896 -0.2424 -0.2449 -0.1485 0.3364 -0.0784 0.3054 0.5068 0.0562 -0.2502 -0.1368 -0.1944 0.1977 -0.0958 -0.1835 0.2228 -0.1564 -0.2005 -0.1150 -0.0938 -0.1394 0.0909 0.0852 0.0889 0.1050 0.0906 0.0757 0.0947 0.1017 0.1157 0.1227 0.1159 0.1249 0.1287 0.1304 0.1370 0.1274 0.1311 0.1275 0.1278
va: 1.2887 1.1329 1.1467 1.1475 2.1211 2.1418 2.1103 3.1202 3.7723 3.8220 3.8653 3.9150 3.9116 3.8927 4.2492 4.0708 3.8392 4.4804 3.6643 4.0166 3.9663 4.0146 3.8868 3.9509 4.0291 3.8156 3.9487 4.0380 3.9487 3.9337 3.9586 1.0512 1.0356 1.0027 1.0210 1.0013 1.0104 1.0044 1.0021 1.0297 1.0244 1.0147 1.0189 0.9994 1.0109 1.0024 1.0129 0.9993 0.9988 1.0000
dispcorr: -0.023898468 hartree
energy: -1928.188966045611
dipole: -44.55393 43.71127 -0.84267 28.65868 -28.22005 0.43863 -11.24471 9.80639 -1.43832
magnitude: 1.72373 au
magnitude: 4.38138 debye
