program: Orca
programVersion: 5.0.2
elementType: Cl F F F O O O N C C C C C C C C C C C C C C C C C C C C C C C H H H H H H H H H H H H H H H H H H H
charge: 0
multiplicity: 1
keywords: wb97x-d3
keywords: def2-TZVPP
keywords: def2/J RIJCOSX
keywords: DEFGRID2
keywords: scfconv7
keywords: smallprint printgap noloewdin
keywords: NOSOSCF
formula: C23H19ClF3NO3
InChI: InChI=1/C23H19ClF3NO3/c1-22(2)17(12-19(24)23(25,26)27)20(22)21(29)31-18(13-28)14-7-6-10-16(11-14)30-15-8-4-3-5-9-15/h3-12,17-18,20H,1-2H3
50 atoms
Cl 4.966842 -1.349982 -1.014025
F  4.388647 -5.079264 -0.109074
F  5.867012 -3.685267 0.6057
F  5.838577 -4.246699 -1.467057
O  -1.250959 -1.154205 0.823876
O  0.221346 0.343848 0.053502
O  -3.528655 4.142153 -0.481918
N  -3.501085 -1.198995 3.251328
C  0.734785 -2.018892 -2.001962
C  1.871914 -1.857716 -1.030362
C  0.454654 -1.971414 -0.515272
C  0.400857 -0.840801 -2.883765
C  0.510363 -3.349666 -2.680076
C  2.814825 -2.943174 -0.750562
C  -0.161413 -0.789704 0.123524
C  4.136895 -2.827884 -0.713331
C  -1.974444 -0.098223 1.43898
C  5.06319 -3.969068 -0.417726
C  -2.810557 0.676613 0.448127
C  -2.825565 -0.734903 2.446979
C  -2.754104 2.06034 0.457021
C  -3.630506 0.005589 -0.449381
C  -3.545537 2.785632 -0.426164
C  -4.391813 0.739259 -1.344452
C  -4.360477 2.124345 -1.334784
C  -3.243813 4.858649 0.650067
C  -2.252283 5.82396 0.577592
C  -3.95727 4.660192 1.825434
C  -1.974019 6.599482 1.694054
C  -3.66182 5.434167 2.936178
C  -2.670915 6.404446 2.876427
H  2.287332 -0.857481 -0.988695
H  0.164989 -2.918133 -0.07255
H  0.622613 0.116571 -2.419107
H  0.976391 -0.902859 -3.808488
H  -0.657321 -0.846885 -3.151169
H  0.666592 -4.201816 -2.019639
H  -0.512593 -3.413484 -3.053166
H  1.182958 -3.462837 -3.531484
H  2.402536 -3.923904 -0.54922
H  -1.292911 0.584415 1.957566
H  -2.089835 2.570017 1.143832
H  -3.6813 -1.075334 -0.448813
H  -5.03319 0.22836 -2.049936
H  -4.964091 2.698573 -2.025091
H  -1.709384 5.965229 -0.347654
H  -4.736976 3.91023 1.87257
H  -1.201719 7.355174 1.637533
H  -4.215836 5.280055 3.852565
H  -2.447362 7.007489 3.745973
totalener: -1928.16504659 hartree
nucrepener: 3051.46755415 hartree
electener: -4979.63260075 hartree
oneelecener: -8709.65168728 hartree
twoeener: 3730.01908653 hartree
kineticenergy: 1921.68786261 hartree
xcener: -157.121203931234 hartree
chargesum: 0.0000000
charge: -0.047575 -0.170114 -0.158280 -0.159894 -0.263594 -0.359500 -0.296214 0.001185 0.055862 0.039325 -0.090526 -0.241223 -0.237061 -0.156437 0.325761 -0.076712 0.306330 0.506114 0.036276 -0.253296 -0.114490 -0.211498 0.203974 -0.089270 -0.188682 0.221186 -0.192792 -0.159604 -0.097886 -0.115454 -0.135556 0.090629 0.085200 0.102394 0.092976 0.088128 0.073847 0.095546 0.102202 0.118213 0.121232 0.113838 0.124865 0.128868 0.129865 0.127629 0.136652 0.127844 0.131277 0.128443
qa: -0.0476 -0.1701 -0.1583 -0.1599 -0.2636 -0.3595 -0.2962 0.0012 0.0559 0.0393 -0.0905 -0.2412 -0.2371 -0.1564 0.3258 -0.0767 0.3063 0.5061 0.0363 -0.2533 -0.1145 -0.2115 0.2040 -0.0893 -0.1887 0.2212 -0.1928 -0.1596 -0.0979 -0.1155 -0.1356 0.0906 0.0852 0.1024 0.0930 0.0881 0.0738 0.0955 0.1022 0.1182 0.1212 0.1138 0.1249 0.1289 0.1299 0.1276 0.1367 0.1278 0.1313 0.1284
va: 1.2877 1.1328 1.1496 1.1441 2.1301 2.1483 2.1135 3.1203 3.7943 3.7978 3.8666 3.9133 3.9055 3.8848 4.2729 4.0631 3.8479 4.4831 3.6474 4.0177 3.9377 4.0187 3.8841 3.9442 4.0304 3.8214 4.0381 3.9618 3.9331 3.9466 3.9565 1.0524 1.0354 1.0199 1.0020 1.0035 1.0101 1.0044 1.0025 1.0266 1.0203 1.0178 1.0184 0.9988 1.0112 1.0125 1.0022 0.9989 0.9992 0.9999
dispcorr: -0.024499418 hartree
energy: -1928.189546012194
dipole: -44.29595 43.71156 -0.58439 26.99268 -26.43001 0.56266 -7.28427 6.14403 -1.14024
magnitude: 1.39937 au
magnitude: 3.55693 debye
