program: Orca
programVersion: 5.0.2
elementType: Cl F F F O O O N C C C C C C C C C C C C C C C C C C C C C C C H H H H H H H H H H H H H H H H H H H
charge: 0
multiplicity: 1
keywords: wb97x-d3
keywords: def2-TZVPP
keywords: def2/J RIJCOSX
keywords: DEFGRID2
keywords: scfconv7
keywords: smallprint printgap noloewdin
keywords: NOSOSCF
formula: C23H19ClF3NO3
InChI: InChI=1/C23H19ClF3NO3/c1-22(2)17(12-19(24)23(25,26)27)20(22)21(29)31-18(13-28)14-7-6-10-16(11-14)30-15-8-4-3-5-9-15/h3-12,17-18,20H,1-2H3
50 atoms
Cl 2.804895 0.291891 -0.596563
F  5.405861 -0.754729 0.451159
F  4.570346 -1.981286 2.010495
F  4.316071 0.157058 2.059302
O  -1.802151 -1.554038 -0.43582
O  -2.362821 -2.711287 1.395194
O  -1.691176 3.702145 0.404865
N  -3.623856 -0.440567 -2.95726
C  0.518036 -3.577177 -0.624088
C  0.982779 -2.229542 -0.140149
C  -0.165831 -2.934506 0.559384
C  -0.149164 -3.64511 -1.977517
C  1.333693 -4.81239 -0.318881
C  2.24182 -2.058742 0.587324
C  -1.548759 -2.406306 0.569326
C  3.08001 -1.035481 0.469114
C  -3.089622 -0.937924 -0.449075
C  4.3519 -0.904324 1.252993
C  -3.088891 0.312631 0.392725
C  -3.377534 -0.660203 -1.857427
C  -2.392463 1.433075 -0.050785
C  -3.725475 0.312567 1.622408
C  -2.338805 2.562976 0.751359
C  -3.668155 1.4532 2.413171
C  -2.979777 2.572527 1.988614
C  -0.998354 3.740808 -0.779627
C  0.307873 3.278704 -0.829321
C  -1.611896 4.270916 -1.902847
C  1.008477 3.361262 -2.023376
C  -0.901261 4.347761 -3.091453
C  0.407194 3.892518 -3.155173
H  0.698003 -1.398226 -0.773143
H  0.065857 -3.392907 1.514261
H  -0.894967 -4.441517 -1.99941
H  -0.636338 -2.718953 -2.269188
H  0.597813 -3.874201 -2.73854
H  0.707854 -5.701728 -0.402022
H  2.155513 -4.915888 -1.028745
H  1.758541 -4.814658 0.68413
H  2.516572 -2.832536 1.292983
H  -3.849635 -1.634146 -0.082516
H  -1.906896 1.421343 -1.018907
H  -4.247369 -0.569051 1.968815
H  -4.161794 1.465755 3.375498
H  -2.93183 3.461889 2.602974
H  0.771265 2.863811 0.056639
H  -2.633283 4.62334 -1.842416
H  2.031498 3.01179 -2.067243
H  -1.375549 4.762056 -3.971067
H  0.95801 3.953606 -4.083974
totalener: -1928.16359515 hartree
nucrepener: 3247.65341369 hartree
electener: -5175.81700884 hartree
oneelecener: -9102.03937996 hartree
twoeener: 3926.22237112 hartree
kineticenergy: 1921.67970008 hartree
xcener: -157.120000880057 hartree
chargesum: -0.0000000
charge: -0.067371 -0.159659 -0.169300 -0.159318 -0.269564 -0.351887 -0.294361 0.001619 0.056702 0.066207 -0.096032 -0.244836 -0.250678 -0.167006 0.363146 -0.060790 0.298696 0.504218 -0.008877 -0.278105 -0.178038 -0.144223 0.247483 -0.078670 -0.206183 0.185559 -0.140491 -0.140148 -0.114118 -0.120958 -0.119871 0.085971 0.085676 0.095518 0.097464 0.090259 0.098645 0.100763 0.075287 0.116230 0.124112 0.120571 0.118484 0.127621 0.127558 0.123424 0.126958 0.126190 0.127985 0.128138
qa: -0.0674 -0.1597 -0.1693 -0.1593 -0.2696 -0.3519 -0.2944 0.0016 0.0567 0.0662 -0.0960 -0.2448 -0.2507 -0.1670 0.3631 -0.0608 0.2987 0.5042 -0.0089 -0.2781 -0.1780 -0.1442 0.2475 -0.0787 -0.2062 0.1856 -0.1405 -0.1401 -0.1141 -0.1210 -0.1199 0.0860 0.0857 0.0955 0.0975 0.0903 0.0986 0.1008 0.0753 0.1162 0.1241 0.1206 0.1185 0.1276 0.1276 0.1234 0.1270 0.1262 0.1280 0.1281
va: 1.2807 1.1474 1.1339 1.1461 2.1147 2.1554 2.1221 3.1112 3.7704 3.7526 3.8706 3.9217 3.9187 3.9002 4.2581 4.0487 3.8551 4.4844 3.7054 4.0198 3.9703 3.9958 3.8619 3.9520 4.0422 3.8936 3.9811 4.0102 3.9261 3.9577 3.9741 1.0432 1.0319 1.0016 1.0135 1.0028 1.0030 1.0018 1.0111 1.0296 1.0189 1.0238 1.0205 0.9991 1.0133 1.0195 1.0086 1.0013 0.9998 1.0005
dispcorr: -0.026818811 hartree
energy: -1928.190413959157
dipole: -27.65075 27.76151 0.11076 -8.43063 7.74382 -0.68681 -12.12627 12.32789 0.20163
magnitude: 0.72431 au
magnitude: 1.84105 debye
