program: Orca
programVersion: 5.0.2
elementType: Cl F F F O O O N C C C C C C C C C C C C C C C C C C C C C C C H H H H H H H H H H H H H H H H H H H
charge: 0
multiplicity: 1
keywords: wb97x-d3
keywords: def2-TZVPP
keywords: def2/J RIJCOSX
keywords: DEFGRID2
keywords: scfconv7
keywords: smallprint printgap noloewdin
keywords: NOSOSCF
formula: C23H19ClF3NO3
InChI: InChI=1/C23H19ClF3NO3/c1-22(2)17(12-19(24)23(25,26)27)20(22)21(29)31-18(13-28)14-7-6-10-16(11-14)30-15-8-4-3-5-9-15/h3-12,17-18,20H,1-2H3
50 atoms
Cl 2.893496 -4.996324 -1.594861
F  5.435047 -3.523433 -2.356636
F  5.712211 -4.774793 -0.632307
F  5.736886 -2.631728 -0.419277
O  -0.530479 0.228524 -0.604845
O  -1.16904 -1.912068 -0.792341
O  -3.561306 3.826582 2.130431
N  -1.161122 2.673799 -2.752956
C  0.981344 -2.34521 1.433796
C  1.56783 -2.707547 0.098913
C  0.894523 -1.360859 0.287218
C  -0.23319 -3.114519 1.895039
C  1.892524 -1.954955 2.573841
C  3.014378 -2.741278 -0.131312
C  -0.373331 -1.092617 -0.422279
C  3.667004 -3.660125 -0.8330
C  -1.756245 0.668175 -1.18933
C  5.149203 -3.644792 -1.059937
C  -2.741019 1.049945 -0.111788
C  -1.411702 1.793664 -2.059172
C  -2.687872 2.308252 0.473509
C  -3.65688 0.104469 0.331392
C  -3.569593 2.625236 1.498349
C  -4.518804 0.42755 1.368572
C  -4.484988 1.682505 1.950608
C  -3.190785 4.955409 1.448993
C  -2.274472 5.80172 2.052525
C  -3.749682 5.276389 0.218639
C  -1.918193 6.983038 1.418563
C  -3.375532 6.453471 -0.409013
C  -2.460087 7.310401 0.185244
H  0.98654 -3.424925 -0.468551
H  1.547574 -0.499607 0.370127
H  0.088086 -3.988999 2.462455
H  -0.849774 -2.500848 2.553964
H  -0.857758 -3.461199 1.076578
H  2.717122 -1.312079 2.26839
H  1.328127 -1.41411 3.334229
H  2.31864 -2.842499 3.043489
H  3.60677 -1.94536 0.302201
H  -2.181387 -0.120183 -1.817194
H  -1.971285 3.043256 0.126788
H  -3.691847 -0.876111 -0.12404
H  -5.235847 -0.302712 1.718853
H  -5.164881 1.942919 2.751005
H  -1.851913 5.536224 3.012655
H  -4.469656 4.61543 -0.246698
H  -1.204364 7.644909 1.890552
H  -3.806271 6.701058 -1.369897
H  -2.172835 8.227632 -0.310307
totalener: -1928.16593139 hartree
nucrepener: 3038.96700063 hartree
electener: -4967.13293202 hartree
oneelecener: -8684.76677645 hartree
twoeener: 3717.63384443 hartree
kineticenergy: 1921.67691307 hartree
xcener: -157.119981850869 hartree
chargesum: -0.0000000
charge: -0.047847 -0.158346 -0.159571 -0.169898 -0.258714 -0.382854 -0.297560 -0.000603 0.061191 0.036346 -0.100805 -0.251412 -0.241063 -0.152327 0.367240 -0.076359 0.313510 0.506263 0.013818 -0.260140 -0.175482 -0.158953 0.209695 -0.091811 -0.197336 0.228840 -0.203270 -0.155203 -0.094098 -0.101702 -0.138760 0.090844 0.083938 0.093149 0.089043 0.103451 0.074789 0.096741 0.101015 0.116582 0.128240 0.129311 0.130625 0.129763 0.129792 0.125460 0.131808 0.126766 0.128582 0.127312
qa: -0.0478 -0.1583 -0.1596 -0.1699 -0.2587 -0.3829 -0.2976 -0.0006 0.0612 0.0363 -0.1008 -0.2514 -0.2411 -0.1523 0.3672 -0.0764 0.3135 0.5063 0.0138 -0.2601 -0.1755 -0.1590 0.2097 -0.0918 -0.1973 0.2288 -0.2033 -0.1552 -0.0941 -0.1017 -0.1388 0.0908 0.0839 0.0931 0.0890 0.1035 0.0748 0.0967 0.1010 0.1166 0.1282 0.1293 0.1306 0.1298 0.1298 0.1255 0.1318 0.1268 0.1286 0.1273
va: 1.2879 1.1477 1.1462 1.1333 2.1316 2.1189 2.1129 3.1112 3.7707 3.8020 3.8904 3.9161 3.9095 3.8896 4.2261 4.0664 3.8226 4.4825 3.6985 4.0308 3.9832 3.9624 3.8773 3.9483 4.0374 3.8143 4.0434 3.9587 3.9365 3.9541 3.9661 1.0506 1.0366 1.0016 1.0023 1.0209 1.0107 1.0041 1.0020 1.0284 1.0206 1.0171 1.0182 0.9992 1.0114 1.0131 1.0033 0.9988 1.0000 1.0002
dispcorr: -0.024209917 hartree
energy: -1928.190141302771
dipole: -39.14931 38.27221 -0.87711 30.96765 -30.84472 0.12293 24.44476 -22.79925 1.64551
magnitude: 1.86872 au
magnitude: 4.74992 debye
