program: Orca
programVersion: 5.0.2
elementType: Cl F F F O O O N C C C C C C C C C C C C C C C C C C C C C C C H H H H H H H H H H H H H H H H H H H
charge: 0
multiplicity: 1
keywords: wb97x-d3
keywords: def2-TZVPP
keywords: def2/J RIJCOSX
keywords: DEFGRID2
keywords: scfconv7
keywords: smallprint printgap noloewdin
keywords: NOSOSCF
formula: C23H19ClF3NO3
InChI: InChI=1/C23H19ClF3NO3/c1-22(2)17(12-19(24)23(25,26)27)20(22)21(29)31-18(13-28)14-7-6-10-16(11-14)30-15-8-4-3-5-9-15/h3-12,17-18,20H,1-2H3
50 atoms
Cl 1.548094 0.322488 -1.066438
F  3.764425 0.647189 0.918443
F  4.558379 -0.086834 -0.936618
F  4.503715 -1.371058 0.790822
O  -2.175725 -2.290506 -0.325799
O  -2.162033 -2.625476 1.885101
O  -0.86627 2.548084 -1.043777
N  -4.472419 -1.552885 -2.569456
C  0.30366 -4.057407 -0.480048
C  0.678762 -2.607064 -0.421208
C  -0.231889 -3.206088 0.647116
C  -0.572811 -4.518267 -1.621195
C  1.306158 -5.109458 -0.064264
C  2.004997 -2.121429 -0.033242
C  -1.610412 -2.698886 0.824119
C  2.466416 -0.897696 -0.268502
C  -3.350208 -1.494146 -0.210999
C  3.832926 -0.426728 0.129376
C  -2.987303 -0.088477 0.199463
C  -3.972823 -1.531508 -1.535651
C  -2.132042 0.647031 -0.606183
C  -3.442456 0.429391 1.403162
C  -1.71921 1.909803 -0.204324
C  -3.036236 1.696465 1.787185
C  -2.175658 2.442796 0.997035
C  -0.413882 3.800809 -0.712944
C  0.775782 3.934648 -0.014364
C  -1.137187 4.913418 -1.113634
C  1.246757 5.205737 0.279905
C  -0.65675 6.178809 -0.812065
C  0.53272 6.3282 -0.113773
H  0.163033 -1.980716 -1.138343
H  0.227115 -3.394232 1.610737
H  0.056731 -4.874834 -2.437602
H  -1.208608 -5.348291 -1.309539
H  -1.212666 -3.736939 -2.020021
H  1.885548 -4.831807 0.815926
H  0.791431 -6.040479 0.176139
H  2.006015 -5.316915 -0.875117
H  2.660882 -2.804123 0.492188
H  -4.04974 -1.930443 0.508644
H  -1.772975 0.251773 -1.548958
H  -4.089266 -0.156672 2.04194
H  -3.381579 2.110646 2.724785
H  -1.863282 3.425312 1.323621
H  1.330976 3.054296 0.283048
H  -2.061083 4.785791 -1.662923
H  2.178433 5.316419 0.818533
H  -1.214919 7.050557 -1.12659
H  0.905738 7.316923 0.116979
totalener: -1928.16154864 hartree
nucrepener: 3288.11092384 hartree
electener: -5216.27247248 hartree
oneelecener: -9183.16973290 hartree
twoeener: 3966.89726043 hartree
kineticenergy: 1921.68731816 hartree
xcener: -157.122013231175 hartree
chargesum: -0.0000000
charge: -0.058022 -0.163099 -0.159194 -0.168888 -0.276712 -0.338955 -0.300670 0.002260 0.077978 -0.000571 -0.044655 -0.235557 -0.272461 -0.147059 0.317970 -0.050359 0.304271 0.499656 0.058265 -0.273978 -0.262943 -0.128867 0.263518 -0.113839 -0.174265 0.182257 -0.119517 -0.133652 -0.146871 -0.129421 -0.109157 0.084145 0.090501 0.088650 0.093308 0.098964 0.076945 0.098807 0.104075 0.119433 0.122112 0.121669 0.110307 0.128110 0.128478 0.118694 0.130109 0.130663 0.128894 0.128674
qa: -0.0580 -0.1631 -0.1592 -0.1689 -0.2767 -0.3390 -0.3007 0.0023 0.0780 -0.0006 -0.0447 -0.2356 -0.2725 -0.1471 0.3180 -0.0504 0.3043 0.4997 0.0583 -0.2740 -0.2629 -0.1289 0.2635 -0.1138 -0.1743 0.1823 -0.1195 -0.1337 -0.1469 -0.1294 -0.1092 0.0841 0.0905 0.0886 0.0933 0.0990 0.0769 0.0988 0.1041 0.1194 0.1221 0.1217 0.1103 0.1281 0.1285 0.1187 0.1301 0.1307 0.1289 0.1287
va: 1.2976 1.1379 1.1475 1.1345 2.1039 2.1705 2.0921 3.1129 3.7929 3.8024 3.8085 3.9070 3.9279 3.9046 4.2942 4.0373 3.8791 4.4801 3.6302 4.0191 4.0680 4.0080 3.8667 3.9869 3.9650 3.8245 3.9706 4.0115 3.9910 3.9550 3.9279 1.0429 1.0279 1.0022 1.0029 1.0144 1.0090 1.0034 1.0004 1.0286 1.0155 1.0327 1.0173 1.0009 1.0114 1.0262 1.0066 1.0002 0.9994 0.9991
dispcorr: -0.028085306 hartree
energy: -1928.189633946671
dipole: -21.33020 21.84158 0.51138 -7.43209 7.32933 -0.10276 1.88375 -1.01609 0.86765
magnitude: 1.01237 au
magnitude: 2.57324 debye
