program: Orca
programVersion: 5.0.2
elementType: Cl F F F O O O N C C C C C C C C C C C C C C C C C C C C C C C H H H H H H H H H H H H H H H H H H H
charge: 0
multiplicity: 1
keywords: wb97x-d3
keywords: def2-TZVPP
keywords: def2/J RIJCOSX
keywords: DEFGRID2
keywords: scfconv7
keywords: smallprint printgap noloewdin
keywords: NOSOSCF
formula: C23H19ClF3NO3
InChI: InChI=1/C23H19ClF3NO3/c1-22(2)17(12-19(24)23(25,26)27)20(22)21(29)31-18(13-28)14-7-6-10-16(11-14)30-15-8-4-3-5-9-15/h3-12,17-18,20H,1-2H3
50 atoms
Cl 2.583151 0.384659 -0.528025
F  4.098042 0.217729 2.098113
F  5.252573 -0.554221 0.46145
F  4.49378 -1.895491 1.966365
O  -1.856334 -1.563914 -0.471298
O  -2.410149 -2.727956 1.356536
O  -1.522109 3.588383 0.661064
N  -3.666304 -0.305214 -2.933306
C  0.456958 -3.601214 -0.691313
C  0.920706 -2.25429 -0.209214
C  -0.221437 -2.963699 0.498534
C  -0.219234 -3.666664 -2.040516
C  1.27487 -4.83628 -0.392699
C  2.177044 -2.06135 0.517344
C  -1.600668 -2.42686 0.52528
C  2.949401 -0.982529 0.455552
C  -3.131124 -0.925686 -0.45269
C  4.207952 -0.806181 1.250441
C  -3.112338 0.292381 0.436212
C  -3.418922 -0.581503 -1.846379
C  -2.314297 1.377194 0.08462
C  -3.848448 0.302291 1.608178
C  -2.268498 2.485906 0.915895
C  -3.792793 1.419206 2.432368
C  -3.011736 2.506525 2.094664
C  -0.848162 3.680744 -0.530851
C  0.50999 3.410215 -0.559202
C  -1.523165 4.071721 -1.677488
C  1.202909 3.546834 -1.753654
C  -0.821924 4.197704 -2.86646
C  0.540268 3.935921 -2.90814
H  0.622957 -1.424756 -0.83828
H  0.019295 -3.424932 1.449777
H  0.523863 -3.884259 -2.80878
H  -0.958763 -4.468898 -2.062182
H  -0.716308 -2.742416 -2.322106
H  0.648241 -5.725582 -0.46965
H  2.090432 -4.940667 -1.10942
H  1.707773 -4.837581 0.606849
H  2.501033 -2.85751 1.175718
H  -3.903471 -1.6222 -0.113027
H  -1.742874 1.35411 -0.835093
H  -4.448264 -0.553909 1.885307
H  -4.363949 1.439559 3.350595
H  -2.967223 3.378384 2.733955
H  1.017796 3.10394 0.345853
H  -2.58491 4.278178 -1.636229
H  2.266441 3.348839 -1.779366
H  -1.344103 4.502109 -3.763579
H  1.083599 4.038167 -3.837668
totalener: -1928.16365419 hartree
nucrepener: 3267.46472333 hartree
electener: -5195.62837752 hartree
oneelecener: -9141.75365668 hartree
twoeener: 3946.12527916 hartree
kineticenergy: 1921.68255297 hartree
xcener: -157.120877954992 hartree
chargesum: 0.0000000
charge: -0.064530 -0.159807 -0.159989 -0.169181 -0.273231 -0.347893 -0.295066 0.000699 0.058389 0.058932 -0.087397 -0.243823 -0.254267 -0.168805 0.354891 -0.056391 0.300935 0.502570 -0.003271 -0.275328 -0.184083 -0.141381 0.250427 -0.078347 -0.206912 0.204772 -0.163729 -0.147056 -0.124685 -0.119711 -0.118382 0.086838 0.086848 0.090346 0.094981 0.097488 0.098364 0.100857 0.075730 0.115883 0.122840 0.118224 0.115084 0.127259 0.127735 0.129879 0.129694 0.135121 0.129864 0.128616
qa: -0.0645 -0.1598 -0.1600 -0.1692 -0.2732 -0.3479 -0.2951 0.0007 0.0584 0.0589 -0.0874 -0.2438 -0.2543 -0.1688 0.3549 -0.0564 0.3009 0.5026 -0.0033 -0.2753 -0.1841 -0.1414 0.2504 -0.0783 -0.2069 0.2048 -0.1637 -0.1471 -0.1247 -0.1197 -0.1184 0.0868 0.0868 0.0903 0.0950 0.0975 0.0984 0.1009 0.0757 0.1159 0.1228 0.1182 0.1151 0.1273 0.1277 0.1299 0.1297 0.1351 0.1299 0.1286
va: 1.2877 1.1449 1.1472 1.1344 2.1149 2.1607 2.1228 3.1128 3.7760 3.7540 3.8564 3.9211 3.9194 3.9090 4.2660 4.0528 3.8641 4.4865 3.6960 4.0167 3.9634 3.9988 3.8535 3.9522 4.0392 3.8538 3.9907 3.9976 3.9053 3.9558 3.9633 1.0426 1.0309 1.0027 1.0017 1.0132 1.0030 1.0016 1.0109 1.0297 1.0194 1.0261 1.0190 0.9993 1.0132 1.0184 1.0062 1.0018 0.9995 1.0001
dispcorr: -0.027144105 hartree
energy: -1928.190798294274
dipole: -26.57507 26.69883 0.12375 -9.37030 8.61252 -0.75778 -12.25675 12.42132 0.16457
magnitude: 0.78526 au
magnitude: 1.99598 debye
