program: Orca
programVersion: 5.0.2
elementType: Cl F F F O O O N C C C C C C C C C C C C C C C C C C C C C C C H H H H H H H H H H H H H H H H H H H
charge: 0
multiplicity: 1
keywords: wb97x-d3
keywords: def2-TZVPP
keywords: def2/J RIJCOSX
keywords: DEFGRID2
keywords: scfconv7
keywords: smallprint printgap noloewdin
keywords: NOSOSCF
formula: C23H19ClF3NO3
InChI: InChI=1/C23H19ClF3NO3/c1-22(2)17(12-19(24)23(25,26)27)20(22)21(29)31-18(13-28)14-7-6-10-16(11-14)30-15-8-4-3-5-9-15/h3-12,17-18,20H,1-2H3
50 atoms
Cl 1.765678 0.221654 -0.764577
F  4.10865 0.143066 1.110332
F  4.734118 -0.437168 -0.861663
F  4.662793 -1.898494 0.718293
O  -2.11852 -2.170171 -0.445517
O  -2.206488 -2.530782 1.75828
O  -0.513621 2.559574 -0.799974
N  -4.310947 -1.325507 -2.762831
C  0.218275 -4.120486 -0.53023
C  0.71327 -2.70819 -0.461159
C  -0.27316 -3.222986 0.58218
C  -0.663565 -4.515026 -1.691852
C  1.118544 -5.250665 -0.085362
C  2.077628 -2.354872 -0.053538
C  -1.619051 -2.623949 0.718558
C  2.620539 -1.147257 -0.162476
C  -3.281811 -1.357344 -0.361405
C  4.040812 -0.834597 0.206241
C  -2.925027 0.034872 0.098452
C  -3.849763 -1.347672 -1.711203
C  -1.921409 0.722304 -0.566089
C  -3.561041 0.599416 1.193267
C  -1.535335 1.978538 -0.122062
C  -3.179686 1.862039 1.617365
C  -2.166407 2.556122 0.975249
C  -0.23559 3.886353 -0.600564
C  -1.114478 4.863482 -1.046218
C  0.958164 4.226235 0.013376
C  -0.789659 6.198468 -0.865493
C  1.275861 5.566684 0.180809
C  0.403297 6.553844 -0.251175
H  0.274282 -2.036684 -1.189413
H  0.141901 -3.444974 1.558376
H  -1.221547 -3.685921 -2.116616
H  -0.044738 -4.934104 -2.486803
H  -1.377123 -5.28408 -1.39182
H  1.82726 -5.512583 -0.872686
H  1.686425 -5.022318 0.816422
H  0.522416 -6.13754 0.132536
H  2.700773 -3.138664 0.357999
H  -4.019651 -1.799249 0.315693
H  -1.423102 0.293023 -1.426664
H  -4.331258 0.053513 1.721626
H  -3.663509 2.30978 2.474924
H  -1.87032 3.531496 1.336732
H  -2.039338 4.580673 -1.532764
H  1.630758 3.446182 0.346071
H  -1.47083 6.964206 -1.211932
H  2.209283 5.837337 0.655938
H  0.653352 7.597276 -0.11524
totalener: -1928.16156708 hartree
nucrepener: 3260.64323142 hartree
electener: -5188.80479850 hartree
oneelecener: -9128.25434524 hartree
twoeener: 3939.44954673 hartree
kineticenergy: 1921.68240580 hartree
xcener: -157.121108895399 hartree
chargesum: 0.0000000
charge: -0.056617 -0.162010 -0.159923 -0.169842 -0.278463 -0.335711 -0.303327 0.002693 0.087460 -0.024572 -0.040612 -0.237619 -0.280253 -0.141382 0.312238 -0.052286 0.296695 0.496922 0.057943 -0.269717 -0.244546 -0.135324 0.251523 -0.108249 -0.171951 0.207946 -0.153504 -0.156859 -0.120431 -0.121337 -0.122429 0.089980 0.092584 0.099169 0.088891 0.093571 0.105997 0.076227 0.099328 0.123510 0.123466 0.124734 0.108315 0.127794 0.132250 0.136432 0.123521 0.129205 0.130376 0.128194
qa: -0.0566 -0.1620 -0.1599 -0.1698 -0.2785 -0.3357 -0.3033 0.0027 0.0875 -0.0246 -0.0406 -0.2376 -0.2803 -0.1414 0.3122 -0.0523 0.2967 0.4969 0.0579 -0.2697 -0.2445 -0.1353 0.2515 -0.1082 -0.1720 0.2079 -0.1535 -0.1569 -0.1204 -0.1213 -0.1224 0.0900 0.0926 0.0992 0.0889 0.0936 0.1060 0.0762 0.0993 0.1235 0.1235 0.1247 0.1083 0.1278 0.1323 0.1364 0.1235 0.1292 0.1304 0.1282
va: 1.3047 1.1434 1.1463 1.1332 2.1005 2.1745 2.0911 3.1133 3.7990 3.8268 3.8049 3.9069 3.9321 3.8739 4.2931 4.0372 3.8807 4.4888 3.6587 4.0161 4.0656 4.0191 3.8691 3.9804 3.9635 3.8147 4.0004 4.0133 3.9515 3.9600 3.9417 1.0359 1.0273 1.0135 1.0023 1.0027 0.9994 1.0077 1.0039 1.0267 1.0168 1.0316 1.0145 1.0012 1.0079 1.0028 1.0191 0.9992 0.9995 0.9995
dispcorr: -0.027521150 hartree
energy: -1928.189088235118
dipole: -24.40262 24.66760 0.26498 -4.96047 4.86421 -0.09626 0.01136 0.78321 0.79457
magnitude: 0.84310 au
magnitude: 2.14299 debye
