program: Orca
programVersion: 5.0.2
elementType: Cl F F F O O O N C C C C C C C C C C C C C C C C C C C C C C C H H H H H H H H H H H H H H H H H H H
charge: 0
multiplicity: 1
keywords: wb97x-d3
keywords: def2-TZVPP
keywords: def2/J RIJCOSX
keywords: DEFGRID2
keywords: scfconv7
keywords: smallprint printgap noloewdin
keywords: NOSOSCF
formula: C23H19ClF3NO3
InChI: InChI=1/C23H19ClF3NO3/c1-22(2)17(12-19(24)23(25,26)27)20(22)21(29)31-18(13-28)14-7-6-10-16(11-14)30-15-8-4-3-5-9-15/h3-12,17-18,20H,1-2H3
50 atoms
Cl 1.565413 0.288364 -1.104344
F  3.685741 0.648281 0.979099
F  4.555066 -0.122186 -0.825612
F  4.424865 -1.374348 0.920253
O  -2.211985 -2.245645 -0.436336
O  -2.307234 -2.58523 1.7715
O  -0.793873 2.572412 -1.096092
N  -4.410069 -1.470346 -2.771342
C  0.249814 -4.061262 -0.455764
C  0.636028 -2.612617 -0.41289
C  -0.323748 -3.180098 0.628844
C  -0.585834 -4.53807 -1.62077
C  1.22481 -5.112532 0.022788
C  1.949977 -2.12833 0.018464
C  -1.705509 -2.661366 0.738216
C  2.434567 -0.916283 -0.231627
C  -3.377548 -1.429746 -0.37211
C  3.784875 -0.441563 0.214151
C  -3.006811 -0.031059 0.054813
C  -3.947691 -1.458001 -1.72016
C  -2.109907 0.692264 -0.716078
C  -3.4946 0.489087 1.244701
C  -1.686626 1.944255 -0.291359
C  -3.077031 1.745416 1.651328
C  -2.173899 2.478532 0.89731
C  -0.308984 3.801665 -0.725836
C  -0.983469 4.946774 -1.119862
C  0.86533 3.879624 0.006574
C  -0.469689 6.188267 -0.776361
C  1.370398 5.127158 0.341773
C  0.705222 6.28168 -0.044509
H  0.156067 -1.998629 -1.164652
H  0.092207 -3.352595 1.614782
H  -1.21386 -3.763235 -2.050449
H  0.071155 -4.903355 -2.411387
H  -1.230107 -5.365705 -1.320103
H  0.692187 -6.032723 0.265484
H  1.952512 -5.345845 -0.755688
H  1.773165 -4.818829 0.917348
H  2.574908 -2.8012 0.592292
H  -4.113564 -1.853527 0.317978
H  -1.725365 0.294834 -1.647828
H  -4.174871 -0.087857 1.85641
H  -3.447175 2.160914 2.578787
H  -1.853163 3.452188 1.241765
H  -1.895943 4.862958 -1.696025
H  1.382635 2.974859 0.298938
H  -0.989909 7.08522 -1.084942
H  2.290073 5.194064 0.907535
H  1.104645 7.251771 0.218551
totalener: -1928.16155116 hartree
nucrepener: 3291.73737056 hartree
electener: -5219.89892171 hartree
oneelecener: -9190.41907284 hartree
twoeener: 3970.52015113 hartree
kineticenergy: 1921.68401179 hartree
xcener: -157.121577911528 hartree
chargesum: -0.0000000
charge: -0.057951 -0.163488 -0.158720 -0.168536 -0.277755 -0.339264 -0.300401 0.002412 0.076192 0.000754 -0.045454 -0.236243 -0.271495 -0.145628 0.319746 -0.052159 0.303703 0.500313 0.057152 -0.273810 -0.263265 -0.129591 0.266186 -0.113359 -0.175496 0.181287 -0.133834 -0.115667 -0.130337 -0.149734 -0.107545 0.084544 0.090641 0.099583 0.088800 0.093035 0.098659 0.103983 0.077112 0.118899 0.122274 0.121173 0.110640 0.128061 0.128435 0.129868 0.118443 0.128937 0.130388 0.128513
qa: -0.0580 -0.1635 -0.1587 -0.1685 -0.2778 -0.3393 -0.3004 0.0024 0.0762 0.0008 -0.0455 -0.2362 -0.2715 -0.1456 0.3197 -0.0522 0.3037 0.5003 0.0572 -0.2738 -0.2633 -0.1296 0.2662 -0.1134 -0.1755 0.1813 -0.1338 -0.1157 -0.1303 -0.1497 -0.1075 0.0845 0.0906 0.0996 0.0888 0.0930 0.0987 0.1040 0.0771 0.1189 0.1223 0.1212 0.1106 0.1281 0.1284 0.1299 0.1184 0.1289 0.1304 0.1285
va: 1.2969 1.1362 1.1482 1.1350 2.1040 2.1697 2.0937 3.1132 3.7972 3.7980 3.8089 3.9070 3.9264 3.9026 4.2917 4.0370 3.8784 4.4787 3.6323 4.0191 4.0680 4.0078 3.8654 3.9864 3.9647 3.8223 4.0090 3.9697 3.9550 3.9943 3.9263 1.0436 1.0277 1.0142 1.0022 1.0028 1.0034 1.0005 1.0091 1.0286 1.0158 1.0328 1.0174 1.0009 1.0114 1.0068 1.0261 0.9994 1.0003 0.9992
dispcorr: -0.028147546 hartree
energy: -1928.189698702736
dipole: -21.11487 21.62418 0.50931 -7.42831 7.29591 -0.13240 1.89992 -0.97258 0.92734
magnitude: 1.06625 au
magnitude: 2.71019 debye
