program: Orca
programVersion: 5.0.2
elementType: Cl F F F O O O N C C C C C C C C C C C C C C C C C C C C C C C H H H H H H H H H H H H H H H H H H H
charge: 0
multiplicity: 1
keywords: wb97x-d3
keywords: def2-TZVPP
keywords: def2/J RIJCOSX
keywords: DEFGRID2
keywords: scfconv7
keywords: smallprint printgap noloewdin
keywords: NOSOSCF
formula: C23H19ClF3NO3
InChI: InChI=1/C23H19ClF3NO3/c1-22(2)17(12-19(24)23(25,26)27)20(22)21(29)31-18(13-28)14-7-6-10-16(11-14)30-15-8-4-3-5-9-15/h3-12,17-18,20H,1-2H3
50 atoms
Cl 2.058332 -0.154822 -2.16784
F  5.000861 -0.701355 -1.307942
F  4.58606 -0.302819 0.768566
F  4.221106 1.20317 -0.725156
O  -2.030164 -1.7487 -0.092676
O  -2.199062 -1.436614 2.111061
O  -1.504232 3.227674 -0.20527
N  -4.067437 -2.111408 -2.656322
C  0.472377 -3.378651 0.607627
C  0.817691 -2.03312 0.02978
C  -0.114851 -2.129448 1.22776
C  -0.368711 -4.307354 -0.235849
C  1.475066 -4.120805 1.458546
C  2.137007 -1.425677 0.212067
C  -1.536649 -1.742889 1.153963
C  2.751266 -0.63137 -0.658771
C  -3.367332 -1.319456 -0.267654
C  4.14078 -0.105026 -0.47265
C  -3.51957 0.183957 -0.155378
C  -3.741635 -1.773488 -1.608615
C  -2.415411 1.008166 -0.298319
C  -4.776052 0.721267 0.094628
C  -2.565212 2.376412 -0.115279
C  -4.918268 2.095015 0.210454
C  -3.813443 2.929333 0.125568
C  -0.306674 2.908194 0.375788
C  0.824918 3.464254 -0.20549
C  -0.200539 2.122944 1.51874
C  2.068817 3.235481 0.361782
C  1.05476 1.890212 2.064677
C  2.192569 2.442248 1.494668
H  0.333595 -1.813626 -0.91386
H  0.31425 -1.861639 2.186601
H  -0.974803 -3.796764 -0.980172
H  0.285151 -4.99745 -0.771847
H  -1.032143 -4.906146 0.391063
H  2.010465 -3.477428 2.15555
H  0.966219 -4.883405 2.05057
H  2.210989 -4.625721 0.830322
H  2.663293 -1.649245 1.13218
H  -4.039224 -1.812587 0.443731
H  -1.438697 0.602388 -0.530645
H  -5.636611 0.073058 0.204038
H  -5.894585 2.521482 0.398778
H  -3.91672 3.999659 0.251542
H  0.728415 4.076102 -1.093763
H  -1.074921 1.694346 1.99139
H  2.944599 3.681037 -0.091088
H  1.13555 1.275995 2.952498
H  3.164671 2.262279 1.933903
elementType: Cl F O N C H
totalener: -1928.18599682 hartree
nucrepener: 3378.11044431 hartree
electener: -5306.29644113 hartree
oneelecener: -9362.87122263 hartree
twoeener: 4056.57478150 hartree
cpcmener: -0.03409515 hartree
kineticenergy: 1921.61575246 hartree
xcener: -157.117261886313 hartree
chargesum: -0.0000000
charge: -0.074415 -0.173650 -0.176071 -0.168295 -0.276396 -0.426027 -0.324633 -0.083165 0.076090 0.079457 -0.068281 -0.264052 -0.277604 -0.212156 0.375976 -0.049591 0.359729 0.524706 0.062605 -0.230575 -0.199039 -0.237444 0.268211 -0.101805 -0.240919 0.320997 -0.265126 -0.197235 -0.111789 -0.160763 -0.188826 0.090222 0.104619 0.094809 0.098296 0.103761 0.093672 0.101202 0.103984 0.140675 0.149713 0.145179 0.146066 0.159692 0.147860 0.143836 0.152134 0.152544 0.158656 0.153168
qa: -0.0744 -0.1737 -0.1761 -0.1683 -0.2764 -0.4260 -0.3246 -0.0832 0.0761 0.0795 -0.0683 -0.2641 -0.2776 -0.2122 0.3760 -0.0496 0.3597 0.5247 0.0626 -0.2306 -0.1990 -0.2374 0.2682 -0.1018 -0.2409 0.3210 -0.2651 -0.1972 -0.1118 -0.1608 -0.1888 0.0902 0.1046 0.0948 0.0983 0.1038 0.0937 0.1012 0.1040 0.1407 0.1497 0.1452 0.1461 0.1597 0.1479 0.1438 0.1521 0.1525 0.1587 0.1532
va: 1.2546 1.1250 1.1268 1.1279 2.1083 2.0767 2.0961 3.1113 3.8084 3.7406 3.8418 3.9133 3.9188 3.8903 4.1683 3.9565 3.7527 4.4632 3.5909 4.0589 3.9541 4.0131 3.7466 3.8795 4.0214 3.6637 4.0074 3.8552 3.8493 3.8504 3.8499 1.0392 1.0254 1.0103 1.0006 0.9996 1.0067 1.0004 0.9996 1.0212 1.0143 1.0074 1.0018 0.9882 1.0049 1.0092 1.0043 0.9945 0.9917 1.0000
dispcorr: -0.031399153 hartree
energy: -1928.217395969461
dipole: -22.91299 23.00178 0.08879 -12.31119 11.26433 -1.04687 16.26699 -14.48546 1.78153
magnitude: 2.06825 au
magnitude: 5.25708 debye
