program: Orca
programVersion: 5.0.2
elementType: Cl F F F O O O N C C C C C C C C C C C C C C C C C C C C C C C H H H H H H H H H H H H H H H H H H H
charge: 0
multiplicity: 1
keywords: wb97x-d3
keywords: def2-TZVPP
keywords: def2/J RIJCOSX
keywords: DEFGRID2
keywords: scfconv7
keywords: smallprint printgap noloewdin
keywords: NOSOSCF
formula: C23H19ClF3NO3
InChI: InChI=1/C23H19ClF3NO3/c1-22(2)17(12-19(24)23(25,26)27)20(22)21(29)31-18(13-28)14-7-6-10-16(11-14)30-15-8-4-3-5-9-15/h3-12,17-18,20H,1-2H3
50 atoms
Cl 5.028344 -1.685321 -0.481152
F  5.843563 -4.551217 -0.896782
F  4.031781 -5.419497 -0.124475
F  5.279951 -4.207347 1.143927
O  -1.057485 -0.96443 0.689804
O  0.368224 0.467315 -0.264195
O  -3.574019 4.22459 -0.583959
N  -2.927534 -0.951768 3.397408
C  0.867296 -1.954934 -2.207459
C  1.961414 -1.911542 -1.177068
C  0.504763 -1.88276 -0.741366
C  0.709538 -0.749346 -3.101337
C  0.53266 -3.25062 -2.906503
C  2.749339 -3.092648 -0.821498
C  -0.027407 -0.659135 -0.115685
C  4.039018 -3.102089 -0.502794
C  -1.697665 0.116816 1.354572
C  4.795343 -4.327765 -0.097206
C  -2.688964 0.830752 0.465567
C  -2.382996 -0.495474 2.495306
C  -2.6426 2.213387 0.37196
C  -3.640472 0.101229 -0.238884
C  -3.580414 2.872707 -0.415142
C  -4.552155 0.771714 -1.037654
C  -4.534458 2.155882 -1.122695
C  -3.256257 5.060657 0.452704
C  -2.499902 6.182541 0.144827
C  -3.717001 4.847933 1.746596
C  -2.201323 7.099252 1.142385
C  -3.399647 5.767404 2.73607
C  -2.642686 6.893777 2.442244
H  2.474985 -0.959605 -1.106856
H  0.115662 -2.803431 -0.321976
H  -0.337936 -0.602091 -3.370967
H  1.077017 0.171947 -2.656102
H  1.267163 -0.910581 -4.025532
H  1.243855 -3.44573 -3.711005
H  0.531877 -4.113127 -2.241119
H  -0.461538 -3.185599 -3.351892
H  2.228412 -4.042397 -0.798966
H  -0.96498 0.824541 1.7560
H  -1.881655 2.765975 0.909816
H  -3.677678 -0.978541 -0.164627
H  -5.296851 0.214427 -1.590384
H  -5.255519 2.6799 -1.737436
H  -2.154452 6.337846 -0.869694
H  -4.320739 3.981742 1.987416
H  -1.61415 7.975399 0.898983
H  -3.755983 5.601263 3.74459
H  -2.402733 7.607381 3.219343
elementType: Cl F O N C H
totalener: -1928.19014817 hartree
nucrepener: 3034.13784700 hartree
electener: -4962.32799516 hartree
oneelecener: -8675.00171168 hartree
twoeener: 3712.67371652 hartree
cpcmener: -0.03332653 hartree
kineticenergy: 1921.60819387 hartree
xcener: -157.111006870053 hartree
chargesum: -0.0000000
charge: -0.070502 -0.173070 -0.171169 -0.173159 -0.280297 -0.439388 -0.325577 -0.086764 0.083793 0.021239 -0.073499 -0.266564 -0.262714 -0.138319 0.387122 -0.077634 0.404806 0.512127 0.019376 -0.225302 -0.178331 -0.222407 0.261015 -0.129291 -0.220370 0.283826 -0.251976 -0.193029 -0.117588 -0.141513 -0.186906 0.084021 0.098583 0.101705 0.096367 0.098586 0.102939 0.091196 0.099424 0.141301 0.137664 0.145641 0.148034 0.159124 0.149107 0.146217 0.157058 0.157829 0.159566 0.157704
qa: -0.0705 -0.1731 -0.1712 -0.1732 -0.2803 -0.4394 -0.3256 -0.0868 0.0838 0.0212 -0.0735 -0.2666 -0.2627 -0.1383 0.3871 -0.0776 0.4048 0.5121 0.0194 -0.2253 -0.1783 -0.2224 0.2610 -0.1293 -0.2204 0.2838 -0.2520 -0.1930 -0.1176 -0.1415 -0.1869 0.0840 0.0986 0.1017 0.0964 0.0986 0.1029 0.0912 0.0994 0.1413 0.1377 0.1456 0.1480 0.1591 0.1491 0.1462 0.1571 0.1578 0.1596 0.1577
va: 1.2626 1.1266 1.1326 1.1255 2.1321 2.0776 2.0825 3.1119 3.7492 3.8581 3.8576 3.9064 3.9116 3.8874 4.1948 3.9947 3.7349 4.4819 3.6018 4.0763 3.9542 3.9734 3.7523 3.9186 4.0089 3.6937 4.0110 3.9115 3.8822 3.8891 3.9084 1.0472 1.0336 0.9993 1.0184 1.0004 1.0002 1.0063 1.0010 1.0180 1.0200 1.0075 1.0108 0.9896 1.0049 1.0082 0.9969 0.9891 0.9901 0.9907
dispcorr: -0.023951358 hartree
energy: -1928.214099523087
dipole: -42.79473 41.78565 -1.00908 31.00281 -30.69318 0.30964 -12.14877 10.48510 -1.66368
magnitude: 1.97026 au
magnitude: 5.00801 debye
