program: Orca
programVersion: 5.0.2
elementType: Cl F F F O O O N C C C C C C C C C C C C C C C C C C C C C C C H H H H H H H H H H H H H H H H H H H
charge: 0
multiplicity: 1
keywords: wb97x-d3
keywords: def2-TZVPP
keywords: def2/J RIJCOSX
keywords: DEFGRID2
keywords: scfconv7
keywords: smallprint printgap noloewdin
keywords: NOSOSCF
formula: C23H19ClF3NO3
InChI: InChI=1/C23H19ClF3NO3/c1-22(2)17(12-19(24)23(25,26)27)20(22)21(29)31-18(13-28)14-7-6-10-16(11-14)30-15-8-4-3-5-9-15/h3-12,17-18,20H,1-2H3
50 atoms
Cl 4.676378 -1.407694 0.748456
F  4.27892 -4.140302 -1.981586
F  5.106579 -4.34253 -0.004025
F  6.000467 -2.984528 -1.408088
O  -1.873914 -1.358869 0.068546
O  -0.386327 -0.246601 1.324858
O  -3.093036 3.959762 -0.255827
N  -4.63075 -2.810216 1.15303
C  1.031481 -0.298534 -1.511907
C  1.787873 -1.117441 -0.49592
C  0.307215 -1.343406 -0.687965
C  0.845459 1.171181 -1.22338
C  1.185708 -0.591789 -2.984445
C  2.705802 -2.169438 -0.931911
C  -0.639246 -0.919135 0.360081
C  3.937769 -2.370659 -0.480983
C  -2.969704 -0.824417 0.813279
C  4.830029 -3.463938 -0.974095
C  -3.560749 0.332716 0.046327
C  -3.904348 -1.935556 0.992098
C  -3.088798 1.611109 0.331881
C  -4.459828 0.123404 -0.988993
C  -3.516809 2.682534 -0.440978
C  -4.889724 1.207783 -1.742194
C  -4.422013 2.482354 -1.479393
C  -2.248133 4.245542 0.791254
C  -0.882258 4.301761 0.562467
C  -2.77911 4.51275 2.043779
C  -0.035759 4.642691 1.608937
C  -1.922745 4.849931 3.082222
C  -0.55216 4.914524 2.868635
H  2.068239 -0.581532 0.403691
H  0.011225 -2.233148 -1.233181
H  1.654464 1.737247 -1.688357
H  -0.094097 1.529542 -1.648704
H  0.852727 1.410842 -0.162137
H  0.34593 -0.168356 -3.537749
H  2.099653 -0.137017 -3.370989
H  1.218371 -1.656299 -3.212887
H  2.347456 -2.845374 -1.698909
H  -2.653207 -0.505345 1.810168
H  -2.38876 1.753535 1.14497
H  -4.827987 -0.869146 -1.217162
H  -5.595749 1.056313 -2.547946
H  -4.753884 3.325159 -2.072878
H  -0.486293 4.090931 -0.423466
H  -3.849462 4.464846 2.202168
H  1.031482 4.694338 1.436591
H  -2.330847 5.06472 4.061327
H  0.110962 5.181039 3.681134
elementType: Cl F O N C H
totalener: -1928.18869316 hartree
nucrepener: 3138.05488737 hartree
electener: -5066.24358053 hartree
oneelecener: -8882.55321797 hartree
twoeener: 3816.30963744 hartree
cpcmener: -0.03168642 hartree
kineticenergy: 1921.62137325 hartree
xcener: -157.112747126538 hartree
chargesum: -0.0000000
charge: -0.070521 -0.171337 -0.173146 -0.173433 -0.269647 -0.431273 -0.323437 -0.087120 0.102098 0.026498 -0.089304 -0.284534 -0.259576 -0.146391 0.382366 -0.076671 0.388584 0.511950 -0.009677 -0.222982 -0.211555 -0.220238 0.319229 -0.109419 -0.238871 0.238605 -0.200710 -0.164960 -0.156031 -0.159632 -0.143391 0.083472 0.101990 0.105376 0.102013 0.094276 0.100787 0.103270 0.090938 0.142374 0.134833 0.133906 0.138256 0.159322 0.146579 0.157907 0.152060 0.158222 0.159401 0.159546
qa: -0.0705 -0.1713 -0.1731 -0.1734 -0.2696 -0.4313 -0.3234 -0.0871 0.1021 0.0265 -0.0893 -0.2845 -0.2596 -0.1464 0.3824 -0.0767 0.3886 0.5120 -0.0097 -0.2230 -0.2116 -0.2202 0.3192 -0.1094 -0.2389 0.2386 -0.2007 -0.1650 -0.1560 -0.1596 -0.1434 0.0835 0.1020 0.1054 0.1020 0.0943 0.1008 0.1033 0.0909 0.1424 0.1348 0.1339 0.1383 0.1593 0.1466 0.1579 0.1521 0.1582 0.1594 0.1595
va: 1.2624 1.1317 1.1254 1.1263 2.1225 2.0807 2.0908 3.1099 3.7602 3.8492 3.8625 3.9090 3.9021 3.8763 4.2256 3.9942 3.7451 4.4823 3.7485 4.0686 3.8676 4.0018 3.7009 3.9167 4.0253 3.7139 3.9665 3.9527 3.9055 3.8978 3.8808 1.0472 1.0325 1.0020 0.9967 1.0132 1.0014 1.0007 1.0065 1.0164 1.0236 1.0276 1.0109 0.9890 1.0076 0.9951 1.0000 0.9910 0.9900 0.9894
dispcorr: -0.026513666 hartree
energy: -1928.215206828005
dipole: -35.33464 35.10831 -0.22634 35.64439 -33.77038 1.87400 -4.89163 3.67750 -1.21413
magnitude: 2.24438 au
magnitude: 5.70475 debye
