program: Orca
programVersion: 5.0.2
elementType: Cl F F F O O O N C C C C C C C C C C C C C C C C C C C C C C C H H H H H H H H H H H H H H H H H H H
charge: 0
multiplicity: 1
keywords: wb97x-d3
keywords: def2-TZVPP
keywords: def2/J RIJCOSX
keywords: DEFGRID2
keywords: scfconv7
keywords: smallprint printgap noloewdin
keywords: NOSOSCF
formula: C23H19ClF3NO3
InChI: InChI=1/C23H19ClF3NO3/c1-22(2)17(12-19(24)23(25,26)27)20(22)21(29)31-18(13-28)14-7-6-10-16(11-14)30-15-8-4-3-5-9-15/h3-12,17-18,20H,1-2H3
50 atoms
Cl 4.698352 -2.304763 0.9575
F  5.945049 -4.469727 -0.658639
F  4.123673 -5.482306 -1.194293
F  4.719485 -5.345612 0.87124
O  -1.635517 -1.56372 -0.032207
O  -0.007361 -0.348455 0.896805
O  -3.323244 3.876056 1.487861
N  -4.795111 -2.246554 0.628216
C  1.365602 -1.236658 -1.833723
C  2.012866 -1.887641 -0.639188
C  0.509703 -1.952488 -0.810762
C  1.390012 0.270218 -1.895266
C  1.457302 -1.885564 -3.193445
C  2.787341 -3.122421 -0.767353
C  -0.352733 -1.194477 0.114959
C  3.927917 -3.392429 -0.142614
C  -2.593502 -0.843102 0.730953
C  4.677504 -4.677737 -0.287662
C  -2.84615 0.542282 0.180969
C  -3.817843 -1.64416 0.660302
C  -2.924283 1.613953 1.055503
C  -3.012471 0.731731 -1.185918
C  -3.194679 2.884944 0.563133
C  -3.268848 2.007068 -1.663226
C  -3.371087 3.088322 -0.799593
C  -2.977929 5.167609 1.190714
C  -3.829913 6.166133 1.639684
C  -1.796866 5.483714 0.530605
C  -3.49487 7.495761 1.426219
C  -1.481236 6.817261 0.313644
C  -2.324703 7.827071 0.757706
H  2.35529 -1.192899 0.118817
H  0.092922 -2.896406 -1.144119
H  2.274549 0.596674 -2.444959
H  0.513707 0.65042 -2.423873
H  1.425206 0.743208 -0.916093
H  0.677695 -1.490809 -3.84702
H  2.420462 -1.667823 -3.658346
H  1.335652 -2.967526 -3.163742
H  2.394746 -3.886016 -1.42826
H  -2.299504 -0.786996 1.784399
H  -2.782538 1.468421 2.120048
H  -2.951221 -0.100745 -1.875334
H  -3.405618 2.165199 -2.724848
H  -3.591462 4.07193 -1.19404
H  -4.743931 5.903102 2.15745
H  -1.124246 4.705755 0.191353
H  -4.158055 8.274205 1.780788
H  -0.562161 7.065263 -0.201558
H  -2.068604 8.864567 0.587821
elementType: Cl F O N C H
totalener: -1928.19004386 hartree
nucrepener: 3028.66465479 hartree
electener: -4956.85469864 hartree
oneelecener: -8663.94531623 hartree
twoeener: 3707.09061759 hartree
cpcmener: -0.03406234 hartree
kineticenergy: 1921.60956311 hartree
xcener: -157.111763994820 hartree
chargesum: -0.0000000
charge: -0.070935 -0.173410 -0.171407 -0.173141 -0.277187 -0.430433 -0.324100 -0.086693 0.084893 0.020497 -0.067812 -0.262818 -0.262583 -0.141865 0.364166 -0.073332 0.403022 0.511181 0.035219 -0.226436 -0.235984 -0.233832 0.274761 -0.134796 -0.181116 0.282692 -0.245491 -0.196947 -0.122300 -0.142481 -0.182572 0.080217 0.102430 0.102367 0.097192 0.095999 0.100170 0.103499 0.091823 0.141893 0.142686 0.135007 0.148045 0.159949 0.158548 0.146370 0.159083 0.158268 0.159867 0.157830
qa: -0.0709 -0.1734 -0.1714 -0.1731 -0.2772 -0.4304 -0.3241 -0.0867 0.0849 0.0205 -0.0678 -0.2628 -0.2626 -0.1419 0.3642 -0.0733 0.4030 0.5112 0.0352 -0.2264 -0.2360 -0.2338 0.2748 -0.1348 -0.1811 0.2827 -0.2455 -0.1969 -0.1223 -0.1425 -0.1826 0.0802 0.1024 0.1024 0.0972 0.0960 0.1002 0.1035 0.0918 0.1419 0.1427 0.1350 0.1480 0.1599 0.1585 0.1464 0.1591 0.1583 0.1599 0.1578
va: 1.2623 1.1267 1.1322 1.1248 2.1279 2.0830 2.0821 3.1129 3.7633 3.8609 3.8373 3.9060 3.9065 3.8844 4.2395 3.9918 3.7192 4.4833 3.6085 4.0797 4.0868 3.9614 3.7667 3.9123 3.9151 3.6875 4.0110 3.9187 3.8843 3.8887 3.9050 1.0510 1.0315 1.0010 1.0013 1.0164 1.0013 1.0005 1.0061 1.0174 1.0174 1.0186 1.0125 0.9907 0.9949 1.0079 0.9963 0.9891 0.9901 0.9906
dispcorr: -0.024452460 hartree
energy: -1928.214496317007
dipole: -33.68482 33.84326 0.15843 45.07639 -43.33782 1.73857 -15.50906 13.60293 -1.90612
magnitude: 2.58477 au
magnitude: 6.56996 debye
