program: Orca
programVersion: 5.0.2
elementType: Cl F F F O O O N C C C C C C C C C C C C C C C C C C C C C C C H H H H H H H H H H H H H H H H H H H
charge: 0
multiplicity: 1
keywords: wb97x-d3
keywords: def2-TZVPP
keywords: def2/J RIJCOSX
keywords: DEFGRID2
keywords: scfconv7
keywords: smallprint printgap noloewdin
keywords: NOSOSCF
formula: C23H19ClF3NO3
InChI: InChI=1/C23H19ClF3NO3/c1-22(2)17(12-19(24)23(25,26)27)20(22)21(29)31-18(13-28)14-7-6-10-16(11-14)30-15-8-4-3-5-9-15/h3-12,17-18,20H,1-2H3
50 atoms
Cl 2.605216 -0.682287 -2.648442
F  4.56319 -0.532962 0.699742
F  4.425635 0.908266 -0.892599
F  5.285142 -1.022545 -1.267687
O  -2.296271 -1.386725 1.286308
O  -2.090098 -1.843392 -0.887828
O  -1.744074 3.600735 0.23442
N  -5.243515 -2.682836 0.205536
C  0.417938 -3.456735 0.102226
C  0.851962 -2.135294 -0.471593
C  -0.232135 -2.181996 0.592777
C  -0.3170 -4.403598 -0.813868
C  1.298819 -4.170103 1.100394
C  2.147971 -1.546466 -0.131567
C  -1.604103 -1.803853 0.211588
C  2.964828 -0.926243 -0.976145
C  -3.590857 -0.846549 1.060996
C  4.311045 -0.391842 -0.601175
C  -3.553812 0.413571 0.222612
C  -4.498967 -1.876405 0.5435
C  -2.673591 1.410182 0.630226
C  -4.352957 0.596686 -0.895203
C  -2.574186 2.578017 -0.111555
C  -4.267268 1.786352 -1.606123
C  -3.37391 2.773707 -1.231216
C  -0.568984 3.351221 0.893636
C  -0.263863 4.160644 1.977003
C  0.319953 2.373628 0.463629
C  0.945303 3.990873 2.637048
C  1.517549 2.205882 1.142067
C  1.836994 3.010656 2.227517
H  0.491896 -1.942208 -1.475628
H  0.058993 -1.87262 1.590072
H  -0.860025 -3.903181 -1.611921
H  0.400434 -5.080115 -1.281717
H  -1.025905 -5.014257 -0.251557
H  1.7499 -3.502592 1.833478
H  0.713414 -4.907047 1.652597
H  2.10328 -4.702445 0.589782
H  2.475597 -1.63457 0.897162
H  -3.953249 -0.601415 2.063058
H  -2.068929 1.272724 1.518401
H  -5.038339 -0.172872 -1.225644
H  -4.89041 1.934452 -2.478098
H  -3.294247 3.692665 -1.797991
H  -0.965207 4.921321 2.295798
H  0.089524 1.748832 -0.390459
H  1.184495 4.626842 3.479175
H  2.209682 1.44379 0.810964
H  2.776437 2.875959 2.747176
elementType: Cl F O N C H
totalener: -1928.18826017 hartree
nucrepener: 3280.85731709 hartree
electener: -5209.04557726 hartree
oneelecener: -9168.28467076 hartree
twoeener: 3959.23909350 hartree
cpcmener: -0.03484701 hartree
kineticenergy: 1921.61779780 hartree
xcener: -157.116991281801 hartree
chargesum: 0.0000000
charge: -0.071932 -0.176321 -0.174758 -0.172716 -0.288284 -0.432795 -0.326955 -0.077562 0.079580 0.054453 -0.074878 -0.266579 -0.264285 -0.192058 0.398700 -0.064424 0.503026 0.533355 -0.035996 -0.258059 -0.253803 -0.191246 0.279943 -0.108987 -0.240322 0.304242 -0.255777 -0.238984 -0.099531 -0.073793 -0.227380 0.085351 0.097478 0.095989 0.098999 0.102253 0.091948 0.101069 0.103105 0.145112 0.146535 0.142100 0.133237 0.159033 0.147878 0.145179 0.151486 0.157431 0.156229 0.153714
qa: -0.0719 -0.1763 -0.1748 -0.1727 -0.2883 -0.4328 -0.3270 -0.0776 0.0796 0.0545 -0.0749 -0.2666 -0.2643 -0.1921 0.3987 -0.0644 0.5030 0.5334 -0.0360 -0.2581 -0.2538 -0.1912 0.2799 -0.1090 -0.2403 0.3042 -0.2558 -0.2390 -0.0995 -0.0738 -0.2274 0.0854 0.0975 0.0960 0.0990 0.1023 0.0919 0.1011 0.1031 0.1451 0.1465 0.1421 0.1332 0.1590 0.1479 0.1452 0.1515 0.1574 0.1562 0.1537
va: 1.2587 1.1272 1.1249 1.1287 2.1289 2.0771 2.0900 3.1068 3.7865 3.8048 3.8685 3.9074 3.9075 3.8888 4.1476 3.9634 3.8137 4.4578 3.7365 4.0898 3.9533 3.9249 3.7435 3.9241 4.0118 3.6882 4.0217 3.9411 3.8649 3.7899 3.9697 1.0482 1.0344 1.0188 0.9999 0.9997 1.0065 1.0012 1.0003 1.0168 0.9894 1.0147 1.0180 0.9894 1.0056 1.0081 1.0026 0.9887 0.9870 0.9950
dispcorr: -0.028035045 hartree
energy: -1928.216295216494
dipole: -24.22471 24.96778 0.74307 -8.02929 8.10905 0.07975 13.81575 -11.79341 2.02233
magnitude: 2.15600 au
magnitude: 5.48012 debye
