program: Orca
programVersion: 5.0.2
elementType: Cl F F F O O O N C C C C C C C C C C C C C C C C C C C C C C C H H H H H H H H H H H H H H H H H H H
charge: 0
multiplicity: 1
keywords: wb97x-d3
keywords: def2-TZVPP
keywords: def2/J RIJCOSX
keywords: DEFGRID2
keywords: scfconv7
keywords: smallprint printgap noloewdin
keywords: NOSOSCF
formula: C23H19ClF3NO3
InChI: InChI=1/C23H19ClF3NO3/c1-22(2)17(12-19(24)23(25,26)27)20(22)21(29)31-18(13-28)14-7-6-10-16(11-14)30-15-8-4-3-5-9-15/h3-12,17-18,20H,1-2H3
50 atoms
Cl 2.586258 -5.102462 -0.506708
F  5.410648 -2.523601 -1.167451
F  4.845808 -4.247993 -2.327162
F  5.521071 -4.492101 -0.305268
O  -0.95924 0.264009 -1.118122
O  -1.454834 -1.803823 -0.428286
O  -3.468012 3.51581 2.145598
N  -2.246595 2.298536 -3.373155
C  1.121724 -1.336729 1.314127
C  1.434325 -2.244795 0.154697
C  0.74646 -0.915695 -0.090963
C  0.070239 -1.796595 2.293387
C  2.229465 -0.545331 1.96667
C  2.807438 -2.418311 -0.3225
C  -0.656678 -0.910773 -0.543292
C  3.385998 -3.575422 -0.623735
C  -2.312065 0.450078 -1.528805
C  4.795683 -3.704193 -1.106312
C  -3.187865 0.860232 -0.369967
C  -2.259764 1.491237 -2.556583
C  -2.897166 2.036749 0.316613
C  -4.237377 0.047048 0.022665
C  -3.673737 2.391978 1.408741
C  -5.009642 0.419693 1.116704
C  -4.733282 1.581447 1.81209
C  -2.486727 4.402623 1.764857
C  -2.820419 5.467332 0.942516
C  -1.19504 4.240633 2.241482
C  -1.841588 6.389297 0.598552
C  -0.224401 5.168016 1.888948
C  -0.543525 6.241192 1.067815
H  0.791363 -3.113938 0.077069
H  1.357584 -0.123704 -0.509004
H  -0.461367 -0.943783 2.719525
H  -0.663711 -2.469697 1.857468
H  0.551177 -2.329094 3.115566
H  2.791191 -1.173417 2.65988
H  2.934056 -0.119943 1.253473
H  1.808769 0.283384 2.538014
H  3.405992 -1.522831 -0.43766
H  -2.709558 -0.453048 -2.001765
H  -2.073109 2.662434 -0.005124
H  -4.453786 -0.866988 -0.514639
H  -5.833103 -0.206601 1.433467
H  -5.334934 1.869542 2.665139
H  -3.835314 5.57785 0.581571
H  -0.95237 3.402905 2.883375
H  -2.097023 7.225149 -0.039719
H  0.785487 5.049462 2.259272
H  0.216655 6.961986 0.796781
elementType: Cl F O N C H
totalener: -1928.19057726 hartree
nucrepener: 3095.15128435 hartree
electener: -5023.34186161 hartree
oneelecener: -8797.02179985 hartree
twoeener: 3773.67993824 hartree
cpcmener: -0.03293293 hartree
kineticenergy: 1921.61502610 hartree
xcener: -157.111527955591 hartree
chargesum: 0.0000000
charge: -0.070563 -0.171220 -0.172968 -0.173291 -0.280387 -0.439354 -0.325256 -0.087381 0.084876 0.021970 -0.082841 -0.266778 -0.259669 -0.139921 0.387681 -0.076863 0.414494 0.511773 -0.008985 -0.234602 -0.208217 -0.207798 0.286892 -0.102765 -0.237543 0.217255 -0.168065 -0.171240 -0.156975 -0.158681 -0.144669 0.083536 0.101198 0.101344 0.096689 0.099247 0.102911 0.090914 0.100092 0.142838 0.137847 0.137258 0.144309 0.158177 0.146382 0.150930 0.150534 0.158906 0.158641 0.159335
qa: -0.0706 -0.1712 -0.1730 -0.1733 -0.2804 -0.4394 -0.3253 -0.0874 0.0849 0.0220 -0.0828 -0.2668 -0.2597 -0.1399 0.3877 -0.0769 0.4145 0.5118 -0.0090 -0.2346 -0.2082 -0.2078 0.2869 -0.1028 -0.2375 0.2173 -0.1681 -0.1712 -0.1570 -0.1587 -0.1447 0.0835 0.1012 0.1013 0.0967 0.0992 0.1029 0.0909 0.1001 0.1428 0.1378 0.1373 0.1443 0.1582 0.1464 0.1509 0.1505 0.1589 0.1586 0.1593
va: 1.2625 1.1322 1.1263 1.1259 2.1381 2.0745 2.0896 3.1122 3.7488 3.8519 3.8737 3.9060 3.9090 3.8793 4.2012 3.9922 3.7392 4.4834 3.6646 4.0773 3.9473 3.9624 3.7543 3.9052 4.0071 3.7462 3.9690 3.9510 3.8985 3.8965 3.8777 1.0483 1.0327 0.9991 1.0180 1.0006 1.0007 1.0060 1.0018 1.0164 1.0171 1.0228 1.0075 0.9889 1.0073 1.0007 1.0011 0.9901 0.9903 0.9896
dispcorr: -0.024803596 hartree
energy: -1928.215380855733
dipole: -30.92261 30.78896 -0.13365 36.61484 -35.80049 0.81435 23.13398 -21.29597 1.83801
magnitude: 2.01477 au
magnitude: 5.12114 debye
