program: Orca
programVersion: 5.0.2
elementType: Cl F F F O O O N C C C C C C C C C C C C C C C C C C C C C C C H H H H H H H H H H H H H H H H H H H
charge: 0
multiplicity: 1
keywords: wb97x-d3
keywords: def2-TZVPP
keywords: def2/J RIJCOSX
keywords: DEFGRID2
keywords: scfconv7
keywords: smallprint printgap noloewdin
keywords: NOSOSCF
formula: C23H19ClF3NO3
InChI: InChI=1/C23H19ClF3NO3/c1-22(2)17(12-19(24)23(25,26)27)20(22)21(29)31-18(13-28)14-7-6-10-16(11-14)30-15-8-4-3-5-9-15/h3-12,17-18,20H,1-2H3
50 atoms
Cl 5.247802 -2.407122 -0.543644
F  3.533236 -5.865358 -0.123096
F  5.081599 -4.945556 1.053205
F  5.427382 -5.381542 -1.021664
O  -0.778631 -0.579435 0.474182
O  0.954774 0.591622 -0.33102
O  -4.221085 4.205169 -0.412047
N  -1.887327 -0.184437 3.570026
C  1.180201 -1.862496 -2.276586
C  2.179909 -2.018022 -1.162821
C  0.720858 -1.740892 -0.840748
C  1.303313 -0.644522 -3.158222
C  0.692228 -3.079416 -3.025187
C  2.724078 -3.328251 -0.801224
C  0.356189 -0.446412 -0.235692
C  3.994552 -3.59596 -0.521632
C  -1.314269 0.558477 1.130421
C  4.504389 -4.953271 -0.153129
C  -2.571383 1.048981 0.450386
C  -1.627223 0.127636 2.495784
C  -2.775714 2.416184 0.332475
C  -3.524729 0.144339 -0.002565
C  -3.960858 2.881415 -0.226699
C  -4.688675 0.624833 -0.580619
C  -4.918019 1.987912 -0.686591
C  -3.773318 5.149508 0.472456
C  -3.810409 4.959157 1.848472
C  -3.337795 6.352555 -0.064908
C  -3.390243 5.984067 2.684099
C  -2.934307 7.372974 0.783948
C  -2.950735 7.192184 2.159808
H  2.846469 -1.1730 -1.034427
H  0.146766 -2.583336 -0.472331
H  1.909285 -0.891544 -4.031821
H  0.322371 -0.328199 -3.517897
H  1.77355 0.203491 -2.66627
H  0.505487 -3.936401 -2.379517
H  -0.243186 -2.850887 -3.538732
H  1.420155 -3.37994 -3.780912
H  2.025853 -4.155301 -0.755679
H  -0.579785 1.366608 1.197321
H  -2.013577 3.105689 0.67552
H  -3.371451 -0.922547 0.095003
H  -5.436855 -0.069022 -0.940318
H  -5.834067 2.360321 -1.127563
H  -4.165899 4.028684 2.273162
H  -3.322047 6.488864 -1.139018
H  -3.415816 5.834864 3.755794
H  -2.598683 8.311672 0.3624
H  -2.627913 7.987487 2.818541
elementType: Cl F O N C H
totalener: -1928.18898381 hartree
nucrepener: 3001.81196320 hartree
electener: -4930.00094701 hartree
oneelecener: -8610.13621539 hartree
twoeener: 3680.13526838 hartree
cpcmener: -0.03287787 hartree
kineticenergy: 1921.60611929 hartree
xcener: -157.111051284849 hartree
chargesum: 0.0000000
charge: -0.070581 -0.171353 -0.172805 -0.173016 -0.288904 -0.439713 -0.323924 -0.088227 0.088526 0.023858 -0.096643 -0.267741 -0.259595 -0.142629 0.398865 -0.074667 0.415151 0.511249 0.030267 -0.227154 -0.194670 -0.223425 0.275894 -0.125050 -0.223632 0.297708 -0.206236 -0.255855 -0.137802 -0.115464 -0.188975 0.085236 0.098851 0.098156 0.101857 0.096106 0.090873 0.100354 0.102411 0.142447 0.130951 0.146026 0.146953 0.158917 0.148044 0.157172 0.146395 0.159780 0.157659 0.158357
qa: -0.0706 -0.1714 -0.1728 -0.1730 -0.2889 -0.4397 -0.3239 -0.0882 0.0885 0.0239 -0.0966 -0.2677 -0.2596 -0.1426 0.3989 -0.0747 0.4152 0.5112 0.0303 -0.2272 -0.1947 -0.2234 0.2759 -0.1250 -0.2236 0.2977 -0.2062 -0.2559 -0.1378 -0.1155 -0.1890 0.0852 0.0989 0.0982 0.1019 0.0961 0.0909 0.1004 0.1024 0.1424 0.1310 0.1460 0.1470 0.1589 0.1480 0.1572 0.1464 0.1598 0.1577 0.1584
va: 1.2626 1.1324 1.1270 1.1256 2.1228 2.0774 2.0874 3.1097 3.7412 3.8531 3.8702 3.9080 3.9115 3.8830 4.1900 3.9913 3.6762 4.4831 3.7056 4.0855 3.9595 3.9758 3.7398 3.9214 4.0070 3.6806 3.9195 4.0134 3.8863 3.8800 3.9115 1.0461 1.0338 1.0005 0.9989 1.0182 1.0060 1.0014 1.0008 1.0166 1.0382 1.0044 1.0128 0.9899 1.0056 0.9970 1.0084 0.9900 0.9892 0.9905
dispcorr: -0.023393570 hartree
energy: -1928.212377379501
dipole: -41.48876 40.09076 -1.39799 36.69737 -36.24976 0.44760 -12.30897 10.37025 -1.93872
magnitude: 2.43174 au
magnitude: 6.18099 debye
