program: Orca
programVersion: 5.0.2
elementType: Cl F F F O O O N C C C C C C C C C C C C C C C C C C C C C C C H H H H H H H H H H H H H H H H H H H
charge: 0
multiplicity: 1
keywords: wb97x-d3
keywords: def2-TZVPP
keywords: def2/J RIJCOSX
keywords: DEFGRID2
keywords: scfconv7
keywords: smallprint printgap noloewdin
keywords: NOSOSCF
formula: C23H19ClF3NO3
InChI: InChI=1/C23H19ClF3NO3/c1-22(2)17(12-19(24)23(25,26)27)20(22)21(29)31-18(13-28)14-7-6-10-16(11-14)30-15-8-4-3-5-9-15/h3-12,17-18,20H,1-2H3
50 atoms
Cl 3.004009 -4.85376 -1.256872
F  5.504422 -1.888082 -1.090255
F  5.265673 -3.423723 -2.577195
F  5.841736 -3.949941 -0.577668
O  -0.996537 0.165223 -0.867907
O  -1.410443 -2.025664 -0.634826
O  -3.70371 3.70755 2.066068
N  -2.138209 2.234328 -3.178905
C  1.015447 -1.833793 1.345332
C  1.495715 -2.394312 0.033352
C  0.69204 -1.106355 0.057882
C  -0.041421 -2.616642 2.083526
C  1.983003 -1.135748 2.270515
C  2.901879 -2.308256 -0.362395
C  -0.669263 -1.086531 -0.507042
C  3.622258 -3.277593 -0.914354
C  -2.326081 0.403333 -1.326782
C  5.062132 -3.129057 -1.289881
C  -3.196318 0.846763 -0.177332
C  -2.206997 1.430139 -2.362222
C  -3.02802 2.117456 0.367923
C  -4.101447 -0.048827 0.370826
C  -3.77657 2.484561 1.476971
C  -4.8458 0.334429 1.47983
C  -4.686407 1.589821 2.037106
C  -2.715952 4.592883 1.705674
C  -1.392035 4.3499 2.045356
C  -3.083567 5.756541 1.048642
C  -0.426715 5.289461 1.71351
C  -2.109189 6.693894 0.731263
C  -0.780391 6.461708 1.056597
H  0.955075 -3.270559 -0.306417
H  1.254543 -0.193432 -0.100789
H  0.441094 -3.293037 2.790643
H  -0.689428 -1.950668 2.655731
H  -0.667698 -3.221473 1.432216
H  2.696619 -0.500367 1.747605
H  1.43639 -0.501334 2.970098
H  2.547384 -1.864397 2.854927
H  3.401168 -1.361701 -0.192653
H  -2.748209 -0.487938 -1.799109
H  -2.324113 2.810715 -0.077305
H  -4.225172 -1.035174 -0.057282
H  -5.554927 -0.35582 1.917642
H  -5.266885 1.887316 2.901723
H  -1.117887 3.439321 2.564465
H  -4.122137 5.930413 0.796065
H  0.607322 5.104984 1.974831
H  -2.393572 7.606665 0.22324
H  -0.023541 7.193246 0.804936
elementType: Cl F O N C H
totalener: -1928.18989855 hartree
nucrepener: 3072.57230914 hartree
electener: -5000.76220768 hartree
oneelecener: -8751.76013970 hartree
twoeener: 3750.99793202 hartree
cpcmener: -0.03217967 hartree
kineticenergy: 1921.60473061 hartree
xcener: -157.109784910461 hartree
chargesum: 0.0000000
charge: -0.070366 -0.171499 -0.172942 -0.173074 -0.276894 -0.441701 -0.321863 -0.087263 0.083085 0.028171 -0.091992 -0.271637 -0.258730 -0.141929 0.402876 -0.077245 0.404472 0.511569 -0.007726 -0.231408 -0.201966 -0.198713 0.283520 -0.106426 -0.239846 0.242144 -0.185896 -0.197998 -0.145483 -0.141590 -0.160099 0.084955 0.098039 0.099919 0.101772 0.096805 0.090516 0.101059 0.102086 0.142788 0.132975 0.138694 0.144199 0.158595 0.146568 0.156135 0.147128 0.158631 0.158732 0.158856
qa: -0.0704 -0.1715 -0.1729 -0.1731 -0.2769 -0.4417 -0.3219 -0.0873 0.0831 0.0282 -0.0920 -0.2716 -0.2587 -0.1419 0.4029 -0.0772 0.4045 0.5116 -0.0077 -0.2314 -0.2020 -0.1987 0.2835 -0.1064 -0.2398 0.2421 -0.1859 -0.1980 -0.1455 -0.1416 -0.1601 0.0850 0.0980 0.0999 0.1018 0.0968 0.0905 0.1011 0.1021 0.1428 0.1330 0.1387 0.1442 0.1586 0.1466 0.1561 0.1471 0.1586 0.1587 0.1589
va: 1.2625 1.1318 1.1279 1.1246 2.1344 2.0706 2.0888 3.1089 3.7481 3.8468 3.8744 3.9063 3.9086 3.8786 4.1876 3.9953 3.7388 4.4825 3.7104 4.0823 3.9729 3.9421 3.7708 3.9043 4.0059 3.7180 3.9437 4.0005 3.8873 3.8901 3.8905 1.0458 1.0348 1.0005 0.9992 1.0182 1.0061 1.0012 1.0010 1.0167 1.0218 1.0154 1.0103 0.9889 1.0070 0.9975 1.0046 0.9902 0.9896 0.9901
dispcorr: -0.024304787 hartree
energy: -1928.214203334278
dipole: -34.55236 34.15352 -0.39884 29.77839 -29.29248 0.48592 26.75407 -24.47039 2.28367
magnitude: 2.36862 au
magnitude: 6.02055 debye
