program: Orca
programVersion: 5.0.2
elementType: Cl F F F O O O N C C C C C C C C C C C C C C C C C C C C C C C H H H H H H H H H H H H H H H H H H H
charge: 0
multiplicity: 1
keywords: wb97x-d3
keywords: def2-TZVPP
keywords: def2/J RIJCOSX
keywords: DEFGRID2
keywords: scfconv7
keywords: smallprint printgap noloewdin
keywords: NOSOSCF
formula: C23H19ClF3NO3
InChI: InChI=1/C23H19ClF3NO3/c1-22(2)17(12-19(24)23(25,26)27)20(22)21(29)31-18(13-28)14-7-6-10-16(11-14)30-15-8-4-3-5-9-15/h3-12,17-18,20H,1-2H3
50 atoms
Cl 2.776625 -4.96307 -1.636947
F  5.689368 -2.613818 -0.612274
F  5.321196 -3.516165 -2.532233
F  5.605925 -4.756754 -0.803701
O  -0.824415 0.187422 -0.776808
O  -1.21692 -2.013778 -0.940473
O  -3.933264 3.836363 1.902199
N  -1.86348 2.335882 -3.080773
C  1.01053 -2.01332 1.289359
C  1.528315 -2.572882 -0.008083
C  0.834249 -1.226104 0.007851
C  -0.160532 -2.717479 1.927562
C  1.965986 -1.428108 2.301022
C  2.960955 -2.624702 -0.298572
C  -0.494904 -1.105866 -0.620652
C  3.583542 -3.592263 -0.96189
C  -2.136219 0.487672 -1.256433
C  5.055325 -3.613865 -1.224575
C  -3.013755 0.907275 -0.10368
C  -1.975204 1.533351 -2.267049
C  -3.043323 2.228387 0.327803
C  -3.740096 -0.071849 0.56189
C  -3.806599 2.564406 1.438497
C  -4.497737 0.27961 1.669431
C  -4.531651 1.589504 2.114731
C  -3.000523 4.794659 1.596664
C  -1.654531 4.613495 1.888056
C  -3.457313 5.982475 1.047582
C  -0.760989 5.637899 1.612489
C  -2.553972 7.004529 0.789489
C  -1.204719 6.834816 1.064909
H  0.93471 -3.382603 -0.416077
H  1.462135 -0.34714 -0.081267
H  0.206491 -3.449758 2.648503
H  -0.790178 -2.009374 2.469234
H  -0.785899 -3.25123 1.215762
H  2.747892 -0.816007 1.853565
H  1.42128 -0.792735 3.001209
H  2.446287 -2.220056 2.878385
H  3.570032 -1.805471 0.063521
H  -2.574518 -0.378039 -1.760368
H  -2.484854 2.98914 -0.204495
H  -3.718413 -1.098376 0.220061
H  -5.068248 -0.475609 2.193628
H  -5.125826 1.863824 2.977338
H  -1.304658 3.687332 2.327344
H  -4.510937 6.107864 0.831232
H  0.289035 5.499581 1.835609
H  -2.910092 7.93412 0.364788
H  -0.502226 7.631207 0.857701
elementType: Cl F O N C H
totalener: -1928.18953686 hartree
nucrepener: 3054.09375020 hartree
electener: -4982.28328707 hartree
oneelecener: -8714.74169995 hartree
twoeener: 3732.45841288 hartree
cpcmener: -0.03171505 hartree
kineticenergy: 1921.61626264 hartree
xcener: -157.112971292188 hartree
chargesum: -0.0000000
charge: -0.070833 -0.171402 -0.173177 -0.173016 -0.274114 -0.437992 -0.321781 -0.086752 0.087180 0.018682 -0.085613 -0.272358 -0.268652 -0.142856 0.402039 -0.069708 0.392329 0.510625 -0.007700 -0.222360 -0.192624 -0.199919 0.276746 -0.115417 -0.233114 0.271253 -0.197740 -0.229816 -0.137907 -0.126542 -0.175056 0.081779 0.102523 0.100746 0.100810 0.097608 0.093279 0.100397 0.103764 0.140648 0.134817 0.138795 0.147042 0.158500 0.147402 0.157658 0.146648 0.159118 0.157642 0.158422
qa: -0.0708 -0.1714 -0.1732 -0.1730 -0.2741 -0.4380 -0.3218 -0.0868 0.0872 0.0187 -0.0856 -0.2724 -0.2687 -0.1429 0.4020 -0.0697 0.3923 0.5106 -0.0077 -0.2224 -0.1926 -0.1999 0.2767 -0.1154 -0.2331 0.2713 -0.1977 -0.2298 -0.1379 -0.1265 -0.1751 0.0818 0.1025 0.1007 0.1008 0.0976 0.0933 0.1004 0.1038 0.1406 0.1348 0.1388 0.1470 0.1585 0.1474 0.1577 0.1466 0.1591 0.1576 0.1584
va: 1.2624 1.1322 1.1248 1.1270 2.1268 2.0754 2.0881 3.1085 3.7552 3.8510 3.8547 3.9096 3.9093 3.8910 4.1994 3.9916 3.7281 4.4834 3.7356 4.0761 3.9789 3.9195 3.7828 3.9086 4.0039 3.6964 3.9360 4.0148 3.8839 3.8841 3.9027 1.0504 1.0312 1.0010 0.9997 1.0163 1.0063 1.0009 0.9999 1.0186 1.0257 1.0129 1.0115 0.9894 1.0064 0.9964 1.0067 0.9900 0.9896 0.9903
dispcorr: -0.024310410 hartree
energy: -1928.213847273205
dipole: -34.83262 34.38991 -0.44271 32.11732 -31.68893 0.42839 27.52107 -24.96225 2.55882
magnitude: 2.63194 au
magnitude: 6.68985 debye
