program: Orca
programVersion: 5.0.2
elementType: Cl F F F O O O N C C C C C C C C C C C C C C C C C C C C C C C H H H H H H H H H H H H H H H H H H H
charge: 0
multiplicity: 1
keywords: wb97x-d3
keywords: def2-TZVPP
keywords: def2/J RIJCOSX
keywords: DEFGRID2
keywords: scfconv7
keywords: smallprint printgap noloewdin
keywords: NOSOSCF
formula: C23H19ClF3NO3
InChI: InChI=1/C23H19ClF3NO3/c1-22(2)17(12-19(24)23(25,26)27)20(22)21(29)31-18(13-28)14-7-6-10-16(11-14)30-15-8-4-3-5-9-15/h3-12,17-18,20H,1-2H3
50 atoms
Cl 2.089134 -5.469075 -1.500698
F  5.083276 -5.469712 -1.693382
F  5.305596 -3.341852 -1.930489
F  4.23327 -4.490763 -3.399914
O  -0.374604 0.061063 -0.942322
O  -1.192682 -1.792369 0.004278
O  -1.95234 4.261813 1.667133
N  -1.362413 1.944572 -3.453544
C  1.623057 -1.983686 1.352756
C  1.667115 -2.769687 0.072996
C  1.161739 -1.332045 0.070423
C  0.638039 -2.434037 2.403642
C  2.89499 -1.425316 1.945218
C  2.912295 -3.044591 -0.641206
C  -0.253448 -1.088627 -0.260065
C  3.184137 -4.142259 -1.337567
C  -1.68729 0.455064 -1.332693
C  4.457921 -4.356885 -2.088769
C  -2.383577 1.199859 -0.222111
C  -1.495662 1.29316 -2.517607
C  -1.894286 2.43289 0.196095
C  -3.479855 0.630104 0.407416
C  -2.506105 3.085138 1.252996
C  -4.083472 1.296629 1.465364
C  -3.601208 2.520134 1.898525
C  -2.751829 5.340948 1.930373
C  -3.870183 5.64201 1.162834
C  -2.36341 6.171381 2.972663
C  -4.603176 6.783788 1.455028
C  -3.100356 7.314397 3.245705
C  -4.225098 7.624038 2.493182
H  0.891735 -3.521454 -0.01807
H  1.84509 -0.596563 -0.3382
H  0.270734 -1.584038 2.981061
H  -0.219506 -2.963421 1.996343
H  1.139752 -3.11072 3.097302
H  2.657109 -0.614483 2.635259
H  3.426408 -2.194571 2.50777
H  3.578991 -1.022583 1.199582
H  3.673501 -2.274462 -0.615347
H  -2.282766 -0.409558 -1.642574
H  -1.04159 2.893548 -0.290212
H  -3.860864 -0.328466 0.08034
H  -4.932471 0.851282 1.96666
H  -4.069987 3.024851 2.73403
H  -4.168738 5.004726 0.339701
H  -1.488417 5.925263 3.561249
H  -5.473255 7.01898 0.855657
H  -2.794096 7.961158 4.057852
H  -4.800699 8.513827 2.711441
elementType: Cl F O N C H
totalener: -1928.18987116 hartree
nucrepener: 3008.12336307 hartree
electener: -4936.31323423 hartree
oneelecener: -8623.04224897 hartree
twoeener: 3686.72901474 hartree
cpcmener: -0.03253626 hartree
kineticenergy: 1921.63642904 hartree
xcener: -157.115605752832 hartree
chargesum: 0.0000000
charge: -0.070559 -0.173209 -0.171081 -0.173068 -0.280655 -0.444709 -0.328169 -0.087562 0.083410 0.014601 -0.077649 -0.268278 -0.262487 -0.134836 0.403702 -0.077492 0.421452 0.511728 -0.005169 -0.231284 -0.215886 -0.165976 0.205386 -0.134785 -0.158177 0.261834 -0.167640 -0.237805 -0.156362 -0.127647 -0.179457 0.085885 0.097548 0.102029 0.096793 0.098112 0.100278 0.101559 0.091067 0.141371 0.137602 0.135154 0.144989 0.160269 0.159687 0.155434 0.146101 0.158923 0.156982 0.158043
qa: -0.0706 -0.1732 -0.1711 -0.1731 -0.2807 -0.4447 -0.3282 -0.0876 0.0834 0.0146 -0.0776 -0.2683 -0.2625 -0.1348 0.4037 -0.0775 0.4215 0.5117 -0.0052 -0.2313 -0.2159 -0.1660 0.2054 -0.1348 -0.1582 0.2618 -0.1676 -0.2378 -0.1564 -0.1276 -0.1795 0.0859 0.0975 0.1020 0.0968 0.0981 0.1003 0.1016 0.0911 0.1414 0.1376 0.1352 0.1450 0.1603 0.1597 0.1554 0.1461 0.1589 0.1570 0.1580
va: 1.2625 1.1267 1.1323 1.1254 2.1371 2.0697 2.0667 3.1103 3.7467 3.8619 3.8672 3.9026 3.9129 3.8898 4.1723 3.9953 3.7215 4.4833 3.6366 4.0706 4.0892 3.9443 3.8211 3.9049 3.9238 3.7057 3.8814 3.9947 3.8997 3.8966 3.8970 1.0458 1.0346 0.9992 1.0189 1.0002 1.0008 1.0009 1.0067 1.0182 1.0157 1.0241 1.0093 0.9909 0.9937 0.9977 1.0076 0.9906 0.9893 0.9902
dispcorr: -0.023674568 hartree
energy: -1928.213545726078
dipole: -32.15304 31.32969 -0.82336 41.05255 -40.37072 0.68184 34.73696 -32.13488 2.60207
magnitude: 2.81311 au
magnitude: 7.15037 debye
