program: Orca
programVersion: 5.0.2
elementType: Cl F F F O O O N C C C C C C C C C C C C C C C C C C C C C C C H H H H H H H H H H H H H H H H H H H
charge: 0
multiplicity: 1
keywords: wb97x-d3
keywords: def2-TZVPP
keywords: def2/J RIJCOSX
keywords: DEFGRID2
keywords: scfconv7
keywords: smallprint printgap noloewdin
keywords: NOSOSCF
formula: C23H19ClF3NO3
InChI: InChI=1/C23H19ClF3NO3/c1-22(2)17(12-19(24)23(25,26)27)20(22)21(29)31-18(13-28)14-7-6-10-16(11-14)30-15-8-4-3-5-9-15/h3-12,17-18,20H,1-2H3
50 atoms
Cl 2.359088 0.306909 -1.71421
F  4.318577 -1.003553 1.363253
F  3.655758 1.009469 0.966408
F  4.996535 0.033105 -0.393728
O  -2.395018 -2.133315 0.902412
O  -2.018923 -1.877286 -1.282052
O  -0.975014 2.618965 1.314948
N  -5.293825 -2.575041 -0.84629
C  0.482727 -3.725582 -0.692364
C  0.887823 -2.281509 -0.706691
C  -0.290471 -2.736446 0.149249
C  -0.10157 -4.291928 -1.962098
C  1.294739 -4.733827 0.084354
C  2.074959 -1.774654 -0.018936
C  -1.623005 -2.217312 -0.199134
C  2.763422 -0.69221 -0.365693
C  -3.612958 -1.423414 0.793341
C  3.9384 -0.168393 0.39685
C  -3.413322 0.054427 0.508442
C  -4.524708 -2.070591 -0.15855
C  -2.26269 0.679013 0.977407
C  -4.38507 0.801298 -0.142533
C  -2.095772 2.040313 0.785998
C  -4.207184 2.167274 -0.315932
C  -3.064753 2.799286 0.145042
C  -0.030952 3.183628 0.505407
C  0.996451 3.855416 1.161017
C  -0.040358 3.09484 -0.880473
C  2.009352 4.44703 0.425097
C  0.979516 3.702339 -1.603181
C  2.004817 4.380417 -0.963084
H  0.600086 -1.74601 -1.603974
H  -0.105596 -2.803881 1.215063
H  0.700179 -4.711479 -2.572201
H  -0.802271 -5.098017 -1.738578
H  -0.618329 -3.552066 -2.568662
H  0.690098 -5.618122 0.291581
H  2.164034 -5.053195 -0.492893
H  1.649383 -4.355272 1.042243
H  2.408992 -2.314984 0.858573
H  -4.076592 -1.531955 1.778379
H  -1.489985 0.130845 1.501974
H  -5.28895 0.336218 -0.515165
H  -4.97194 2.744616 -0.818167
H  -2.931346 3.865394 0.010736
H  0.998365 3.908487 2.242788
H  -0.818644 2.559693 -1.408136
H  2.805367 4.966656 0.942924
H  0.966792 3.633923 -2.683488
H  2.793441 4.849073 -1.536791
elementType: Cl F O N C H
totalener: -1928.18629495 hartree
nucrepener: 3313.15936943 hartree
electener: -5241.34566438 hartree
oneelecener: -9234.04884368 hartree
twoeener: 3992.70317930 hartree
cpcmener: -0.03585785 hartree
kineticenergy: 1921.61307022 hartree
xcener: -157.116759747976 hartree
chargesum: 0.0000000
charge: -0.072715 -0.171199 -0.170360 -0.173487 -0.291307 -0.427387 -0.326012 -0.082507 0.085316 0.015588 -0.045444 -0.262172 -0.266556 -0.149136 0.361367 -0.057412 0.498902 0.510530 -0.038615 -0.245896 -0.236021 -0.185319 0.233341 -0.115911 -0.188050 0.340932 -0.265141 -0.205919 -0.121808 -0.184596 -0.182347 0.086130 0.100761 0.099395 0.100558 0.095422 0.099977 0.103966 0.091462 0.141887 0.147901 0.134605 0.136128 0.160912 0.158007 0.142633 0.150111 0.155289 0.157758 0.156442
qa: -0.0727 -0.1712 -0.1704 -0.1735 -0.2913 -0.4274 -0.3260 -0.0825 0.0853 0.0156 -0.0454 -0.2622 -0.2666 -0.1491 0.3614 -0.0574 0.4989 0.5105 -0.0386 -0.2459 -0.2360 -0.1853 0.2333 -0.1159 -0.1881 0.3409 -0.2651 -0.2059 -0.1218 -0.1846 -0.1823 0.0861 0.1008 0.0994 0.1006 0.0954 0.1000 0.1040 0.0915 0.1419 0.1479 0.1346 0.1361 0.1609 0.1580 0.1426 0.1501 0.1553 0.1578 0.1564
va: 1.2600 1.1323 1.1214 1.1286 2.1271 2.0796 2.0751 3.1025 3.8068 3.8471 3.8276 3.9025 3.9082 3.9087 4.1778 3.9676 3.7929 4.4726 3.7727 4.1012 4.0900 3.9575 3.7684 3.9002 3.9719 3.6457 3.9899 3.8406 3.8903 3.8832 3.8912 1.0494 1.0338 1.0000 1.0001 1.0185 1.0012 1.0004 1.0065 1.0187 0.9867 1.0261 1.0153 0.9901 0.9950 1.0105 1.0046 0.9893 0.9911 0.9897
dispcorr: -0.027712197 hartree
energy: -1928.214007147782
dipole: -20.82695 21.29130 0.46435 -9.80676 9.23693 -0.56983 -3.57565 4.92351 1.34785
magnitude: 1.53526 au
magnitude: 3.90233 debye
