program: Orca
programVersion: 5.0.2
elementType: Cl F F F O O O N C C C C C C C C C C C C C C C C C C C C C C C H H H H H H H H H H H H H H H H H H H
charge: 0
multiplicity: 1
keywords: wb97x-d3
keywords: def2-TZVPP
keywords: def2/J RIJCOSX
keywords: DEFGRID2
keywords: scfconv7
keywords: smallprint printgap noloewdin
keywords: NOSOSCF
formula: C23H19ClF3NO3
InChI: InChI=1/C23H19ClF3NO3/c1-22(2)17(12-19(24)23(25,26)27)20(22)21(29)31-18(13-28)14-7-6-10-16(11-14)30-15-8-4-3-5-9-15/h3-12,17-18,20H,1-2H3
50 atoms
Cl 1.395318 -0.337064 -1.12819
F  3.54937 0.666703 0.747444
F  4.387449 0.037624 -1.126715
F  4.752521 -1.115476 0.656107
O  -1.847944 -1.353744 0.291108
O  -1.766446 -3.180162 -0.987436
O  -1.768714 3.708896 0.864977
N  -2.507024 -0.573873 -2.970541
C  0.565898 -4.124968 0.89688
C  1.169235 -3.210042 -0.109246
C  -0.064005 -2.765256 0.662113
C  -0.101606 -5.390341 0.419263
C  1.247776 -4.275632 2.236039
C  2.421407 -2.465797 0.13391
C  -1.295411 -2.514979 -0.101195
C  2.603246 -1.214754 -0.265468
C  -2.982836 -0.882839 -0.41524
C  3.831855 -0.40768 0.002994
C  -3.339526 0.47901 0.130111
C  -2.691949 -0.746618 -1.849965
C  -2.339167 1.438131 0.26221
C  -4.656696 0.775743 0.437391
C  -2.676531 2.711196 0.694922
C  -4.976998 2.054324 0.878823
C  -3.998484 3.022466 1.005664
C  -0.516962 3.601574 0.306133
C  -0.354872 3.57579 -1.07271
C  0.577813 3.576665 1.15478
C  0.926417 3.514944 -1.600594
C  1.855525 3.528546 0.613083
C  2.033668 3.49019 -0.762226
H  0.9860 -3.462349 -1.150999
H  0.121937 -2.03625 1.442231
H  -0.476443 -5.321426 -0.599026
H  0.61832 -6.210305 0.447162
H  -0.934306 -5.662215 1.069781
H  1.687281 -3.343546 2.593768
H  0.534457 -4.610969 2.990394
H  2.044163 -5.020327 2.179506
H  3.224754 -2.964917 0.663563
H  -3.826417 -1.571815 -0.307709
H  -1.312723 1.18978 0.022455
H  -5.427339 0.023165 0.330111
H  -6.002944 2.29913 1.1203
H  -4.249347 4.020166 1.343485
H  -1.217298 3.603473 -1.727483
H  0.431822 3.600343 2.227417
H  1.057764 3.489963 -2.674676
H  2.712763 3.517323 1.273287
H  3.030504 3.443865 -1.180679
elementType: Cl F O N C H
totalener: -1928.18475700 hartree
nucrepener: 3341.05886094 hartree
electener: -5269.24361794 hartree
oneelecener: -9290.07721706 hartree
twoeener: 4020.83359912 hartree
cpcmener: -0.03387410 hartree
kineticenergy: 1921.63328082 hartree
xcener: -157.116267742265 hartree
chargesum: -0.0000000
charge: -0.070159 -0.169458 -0.175621 -0.170404 -0.272811 -0.436359 -0.323714 -0.087316 0.147841 -0.061659 -0.136283 -0.277702 -0.279635 -0.127663 0.390610 -0.028886 0.417391 0.513265 0.000188 -0.239726 -0.180874 -0.214713 0.272407 -0.102203 -0.243387 0.259514 -0.182473 -0.203781 -0.146468 -0.136942 -0.175016 0.125135 0.111380 0.096803 0.094912 0.101908 0.094291 0.099315 0.103330 0.151555 0.133080 0.110675 0.145515 0.157137 0.145669 0.155330 0.146266 0.158099 0.155251 0.156385
qa: -0.0702 -0.1695 -0.1756 -0.1704 -0.2728 -0.4364 -0.3237 -0.0873 0.1478 -0.0617 -0.1363 -0.2777 -0.2796 -0.1277 0.3906 -0.0289 0.4174 0.5133 0.0002 -0.2397 -0.1809 -0.2147 0.2724 -0.1022 -0.2434 0.2595 -0.1825 -0.2038 -0.1465 -0.1369 -0.1750 0.1251 0.1114 0.0968 0.0949 0.1019 0.0943 0.0993 0.1033 0.1516 0.1331 0.1107 0.1455 0.1571 0.1457 0.1553 0.1463 0.1581 0.1553 0.1564
va: 1.2793 1.1237 1.1280 1.1354 2.1518 2.0651 2.0888 3.1099 3.7215 3.8950 3.8531 3.8864 3.9147 3.8472 4.1571 3.9508 3.7617 4.4580 3.7432 4.0231 3.9336 3.9625 3.7761 3.9047 3.9996 3.6958 3.9279 3.9990 3.8553 3.8528 3.8653 1.0204 1.0248 1.0184 1.0012 0.9990 0.9997 1.0031 0.9994 1.0051 1.0152 1.0425 1.0034 0.9895 1.0077 0.9970 1.0052 0.9901 0.9934 0.9925
dispcorr: -0.028941409 hartree
energy: -1928.213698412090
dipole: -20.56174 20.60459 0.04285 -12.93856 11.76521 -1.17335 11.28307 -8.83693 2.44614
magnitude: 2.71334 au
magnitude: 6.89676 debye
