program: Orca
programVersion: 5.0.2
elementType: Cl F F F O O O N C C C C C C C C C C C C C C C C C C C C C C C H H H H H H H H H H H H H H H H H H H
charge: 0
multiplicity: 1
keywords: wb97x-d3
keywords: def2-TZVPP
keywords: def2/J RIJCOSX
keywords: DEFGRID2
keywords: scfconv7
keywords: smallprint printgap noloewdin
keywords: NOSOSCF
formula: C23H19ClF3NO3
InChI: InChI=1/C23H19ClF3NO3/c1-22(2)17(12-19(24)23(25,26)27)20(22)21(29)31-18(13-28)14-7-6-10-16(11-14)30-15-8-4-3-5-9-15/h3-12,17-18,20H,1-2H3
50 atoms
Cl 1.958241 -2.546964 -3.405583
F  5.381992 -2.461641 -1.578877
F  4.730266 -1.399061 -3.331113
F  4.796171 -3.544759 -3.343208
O  -1.094485 -1.242175 0.074692
O  -0.432559 -0.321711 1.996993
O  -2.767927 4.376706 0.860819
N  -3.914384 -1.526819 -1.617522
C  1.014017 -3.390734 0.947666
C  1.360842 -2.643494 -0.314979
C  1.004879 -1.879473 0.947273
C  -0.279071 -4.168683 0.960667
C  2.098726 -4.046083 1.767437
C  2.733986 -2.570698 -0.81853
C  -0.225795 -1.072739 1.079259
C  3.090287 -2.533256 -2.098349
C  -2.276327 -0.451988 0.110827
C  4.505437 -2.483673 -2.581679
C  -2.002702 0.984098 -0.271591
C  -3.182244 -1.072175 -0.858736
C  -2.512984 2.00575 0.513466
C  -1.248264 1.265093 -1.405641
C  -2.255305 3.32533 0.16008
C  -1.003433 2.5853 -1.744734
C  -1.498423 3.619623 -0.964155
C  -2.798645 4.346596 2.229596
C  -1.742052 3.848897 2.982745
C  -3.912803 4.89687 2.847035
C  -1.815163 3.903299 4.367252
C  -3.966881 4.952797 4.232347
C  -2.922654 4.453655 4.998348
H  0.58908 -2.666909 -1.074383
H  1.829248 -1.426934 1.487219
H  -1.03803 -3.76575 0.293122
H  -0.089476 -5.197519 0.649839
H  -0.697463 -4.201888 1.968474
H  3.001104 -3.441666 1.850492
H  1.73837 -4.227905 2.78146
H  2.375566 -5.0099 1.33657
H  3.529776 -2.542835 -0.083528
H  -2.758397 -0.503832 1.092525
H  -3.106015 1.770873 1.389539
H  -0.85158 0.466841 -2.020755
H  -0.413575 2.815277 -2.62202
H  -1.301497 4.651387 -1.226569
H  -0.866906 3.427202 2.503946
H  -4.727364 5.282491 2.24647
H  -0.991936 3.517014 4.954429
H  -4.836199 5.383715 4.712199
H  -2.970119 4.494719 6.078527
elementType: Cl F O N C H
totalener: -1928.18782191 hartree
nucrepener: 3111.03097208 hartree
electener: -5039.21879400 hartree
oneelecener: -8828.67109644 hartree
twoeener: 3789.45230244 hartree
cpcmener: -0.03419403 hartree
kineticenergy: 1921.60265556 hartree
xcener: -157.110253960497 hartree
chargesum: -0.0000000
charge: -0.073398 -0.171037 -0.173295 -0.173227 -0.273537 -0.431203 -0.328476 -0.084278 0.074529 0.041106 -0.080980 -0.261026 -0.273665 -0.155252 0.404825 -0.067733 0.368564 0.508904 0.019797 -0.225516 -0.172776 -0.209003 0.251577 -0.134594 -0.211141 0.272687 -0.180219 -0.246647 -0.146134 -0.120907 -0.185829 0.086218 0.103575 0.094188 0.098740 0.102979 0.093308 0.100040 0.102948 0.141394 0.141483 0.144661 0.144155 0.158801 0.148531 0.154419 0.147141 0.159984 0.157241 0.158078
qa: -0.0734 -0.1710 -0.1733 -0.1732 -0.2735 -0.4312 -0.3285 -0.0843 0.0745 0.0411 -0.0810 -0.2610 -0.2737 -0.1553 0.4048 -0.0677 0.3686 0.5089 0.0198 -0.2255 -0.1728 -0.2090 0.2516 -0.1346 -0.2111 0.2727 -0.1802 -0.2466 -0.1461 -0.1209 -0.1858 0.0862 0.1036 0.0942 0.0987 0.1030 0.0933 0.1000 0.1029 0.1414 0.1415 0.1447 0.1442 0.1588 0.1485 0.1544 0.1471 0.1600 0.1572 0.1581
va: 1.2594 1.1330 1.1260 1.1253 2.1305 2.0800 2.0781 3.1075 3.7809 3.8030 3.8635 3.9110 3.9131 3.8819 4.1723 3.9869 3.7658 4.4865 3.6094 4.0670 3.9416 3.9581 3.7553 3.9213 4.0020 3.7026 3.9010 4.0067 3.8957 3.8865 3.9056 1.0404 1.0271 1.0114 1.0005 1.0000 1.0064 1.0008 1.0000 1.0181 1.0186 1.0064 1.0123 0.9893 1.0044 1.0001 1.0075 0.9901 0.9893 0.9904
dispcorr: -0.025191924 hartree
energy: -1928.213013837696
dipole: -27.49429 28.15687 0.66258 10.49156 -10.78291 -0.29135 37.60103 -35.49578 2.10525
magnitude: 2.22620 au
magnitude: 5.65855 debye
