program: Orca
programVersion: 5.0.2
elementType: Cl F F F O O O N C C C C C C C C C C C C C C C C C C C C C C C H H H H H H H H H H H H H H H H H H H
charge: 0
multiplicity: 1
keywords: wb97x-d3
keywords: def2-TZVPP
keywords: def2/J RIJCOSX
keywords: DEFGRID2
keywords: scfconv7
keywords: smallprint printgap noloewdin
keywords: NOSOSCF
formula: C23H19ClF3NO3
InChI: InChI=1/C23H19ClF3NO3/c1-22(2)17(12-19(24)23(25,26)27)20(22)21(29)31-18(13-28)14-7-6-10-16(11-14)30-15-8-4-3-5-9-15/h3-12,17-18,20H,1-2H3
50 atoms
Cl 3.272302 -4.670537 1.20142
F  4.105992 -5.029567 -2.571921
F  3.017311 -6.383574 -1.302575
F  5.054066 -5.885443 -0.839528
O  -0.681658 -0.505919 -1.0756
O  0.151047 -0.517248 0.996853
O  -3.224899 3.664383 2.194984
N  -3.693775 -0.80691 -2.375978
C  2.914977 -0.498966 -0.471546
C  2.561785 -1.929394 -0.179313
C  1.558869 -1.025495 -0.881901
C  3.066158 0.427471 0.710442
C  3.858334 -0.165338 -1.602638
C  3.105821 -3.047724 -0.949431
C  0.312494 -0.662054 -0.185711
C  3.425037 -4.242387 -0.465654
C  -1.944323 -0.097229 -0.570116
C  3.905946 -5.383506 -1.302957
C  -2.008349 1.395149 -0.343907
C  -2.912665 -0.498892 -1.592686
C  -2.589113 1.880034 0.816772
C  -1.515463 2.268695 -1.306744
C  -2.676372 3.251578 1.018093
C  -1.596987 3.63312 -1.084502
C  -2.17333 4.135745 0.073096
C  -3.928969 4.841586 2.233781
C  -4.969816 5.088216 1.346901
C  -3.60552 5.755792 3.223723
C  -5.687524 6.269751 1.458736
C  -4.339128 6.929895 3.330741
C  -5.376549 7.194018 2.447969
H  2.339303 -2.133423 0.861608
H  1.439392 -1.197358 -1.945326
H  2.49603 0.11565 1.581753
H  4.116693 0.464664 1.004798
H  2.760616 1.442597 0.449919
H  3.735633 0.879601 -1.891995
H  4.895168 -0.303991 -1.290401
H  3.692722 -0.768255 -2.494477
H  3.237058 -2.896751 -2.014223
H  -2.198287 -0.633201 0.350294
H  -2.97579 1.200413 1.566778
H  -1.070661 1.895961 -2.220467
H  -1.206037 4.321605 -1.82171
H  -2.220188 5.205515 0.230373
H  -5.22398 4.366575 0.580261
H  -2.791278 5.547845 3.906431
H  -6.499614 6.46411 0.769951
H  -4.089402 7.643767 4.10488
H  -5.943023 8.112208 2.531423
elementType: Cl F O N C H
totalener: -1928.18940691 hartree
nucrepener: 2995.71884156 hartree
electener: -4923.90824848 hartree
oneelecener: -8598.21304820 hartree
twoeener: 3674.30479973 hartree
cpcmener: -0.03355959 hartree
kineticenergy: 1921.63423366 hartree
xcener: -157.114988041657 hartree
chargesum: 0.0000000
charge: -0.070737 -0.171129 -0.172941 -0.172662 -0.283045 -0.437914 -0.326883 -0.086591 0.083778 0.019088 -0.071491 -0.267577 -0.261703 -0.137714 0.382233 -0.076287 0.406687 0.511704 0.026043 -0.226843 -0.223620 -0.212187 0.239979 -0.150388 -0.156198 0.243894 -0.165269 -0.226477 -0.152295 -0.132180 -0.170673 0.086565 0.097766 0.097218 0.098186 0.101411 0.099992 0.102236 0.091088 0.141213 0.139063 0.135693 0.147667 0.160578 0.158041 0.158770 0.147805 0.159427 0.157825 0.158855
qa: -0.0707 -0.1711 -0.1729 -0.1727 -0.2830 -0.4379 -0.3269 -0.0866 0.0838 0.0191 -0.0715 -0.2676 -0.2617 -0.1377 0.3822 -0.0763 0.4067 0.5117 0.0260 -0.2268 -0.2236 -0.2122 0.2400 -0.1504 -0.1562 0.2439 -0.1653 -0.2265 -0.1523 -0.1322 -0.1707 0.0866 0.0978 0.0972 0.0982 0.1014 0.1000 0.1022 0.0911 0.1412 0.1391 0.1357 0.1477 0.1606 0.1580 0.1588 0.1478 0.1594 0.1578 0.1589
va: 1.2625 1.1329 1.1245 1.1283 2.1256 2.0767 2.0710 3.1127 3.7459 3.8645 3.8584 3.9035 3.9120 3.8888 4.1915 3.9921 3.7199 4.4836 3.6403 4.0769 4.0760 3.9657 3.7858 3.9298 3.8936 3.7187 3.9115 3.9998 3.8949 3.8891 3.8943 1.0447 1.0347 1.0189 1.0003 0.9995 1.0011 1.0006 1.0060 1.0180 1.0207 1.0181 1.0123 0.9912 0.9957 0.9954 1.0062 0.9903 0.9895 0.9899
dispcorr: -0.023727934 hartree
energy: -1928.213134847502
dipole: -20.37739 21.31127 0.93388 59.49840 -56.73922 2.75918 5.95514 -6.09174 -0.13660
magnitude: 2.91614 au
magnitude: 7.41224 debye
