program: Orca
programVersion: 5.0.2
elementType: Cl F F F O O O N C C C C C C C C C C C C C C C C C C C C C C C H H H H H H H H H H H H H H H H H H H
charge: 0
multiplicity: 1
keywords: wb97x-d3
keywords: def2-TZVPP
keywords: def2/J RIJCOSX
keywords: DEFGRID2
keywords: scfconv7
keywords: smallprint printgap noloewdin
keywords: NOSOSCF
formula: C23H19ClF3NO3
InChI: InChI=1/C23H19ClF3NO3/c1-22(2)17(12-19(24)23(25,26)27)20(22)21(29)31-18(13-28)14-7-6-10-16(11-14)30-15-8-4-3-5-9-15/h3-12,17-18,20H,1-2H3
50 atoms
Cl 3.287212 -4.72106 1.172803
F  4.084079 -5.04493 -2.612172
F  3.014883 -6.411771 -1.339208
F  5.05681 -5.911829 -0.898466
O  -0.635038 -0.472227 -1.053265
O  0.186266 -0.546201 1.02417
O  -3.304768 3.688598 2.18215
N  -3.641411 -0.683376 -2.386708
C  2.959251 -0.529185 -0.450201
C  2.587155 -1.958716 -0.174371
C  1.59413 -1.031763 -0.860686
C  3.130561 0.376445 0.744549
C  3.898459 -0.191843 -1.58315
C  3.114449 -3.074175 -0.960269
C  0.3513 -0.664033 -0.160615
C  3.429087 -4.275684 -0.490525
C  -1.893771 -0.053176 -0.548993
C  3.901045 -5.409307 -1.343198
C  -1.940818 1.436591 -0.297998
C  -2.861239 -0.418483 -1.586857
C  -2.595756 1.913031 0.826439
C  -1.373699 2.316801 -1.212414
C  -2.682892 3.282775 1.039322
C  -1.456773 3.679893 -0.978312
C  -2.10801 4.174035 0.142234
C  -4.033644 4.850681 2.181942
C  -4.989158 5.108034 1.206111
C  -3.827899 5.73793 3.227473
C  -5.739496 6.27216 1.285357
C  -4.593517 6.893817 3.299854
C  -5.546767 7.168077 2.329279
H  2.368874 -2.172226 0.865649
H  1.470972 -1.187557 -1.926264
H  2.842527 1.400524 0.500874
H  2.558046 0.06016 1.61297
H  4.1825 0.391007 1.034612
H  3.782993 0.857481 -1.85978
H  4.93588 -0.34298 -1.280191
H  3.72065 -0.78279 -2.480782
H  3.238221 -2.91287 -2.024411
H  -2.164486 -0.603144 0.358399
H  -3.040644 1.227705 1.538497
H  -0.870976 1.95139 -2.098549
H  -1.008678 4.372976 -1.678097
H  -2.157149 5.242398 0.310526
H  -5.154692 4.408298 0.396103
H  -3.079124 5.522339 3.979301
H  -6.485595 6.47454 0.527708
H  -4.434861 7.585628 4.11701
H  -6.138062 8.072475 2.38655
elementType: Cl F O N C H
totalener: -1928.18939647 hartree
nucrepener: 2992.29492794 hartree
electener: -4920.48432442 hartree
oneelecener: -8591.32860920 hartree
twoeener: 3670.84428478 hartree
cpcmener: -0.03370405 hartree
kineticenergy: 1921.61967960 hartree
xcener: -157.112402405585 hartree
chargesum: 0.0000000
charge: -0.070415 -0.171268 -0.172987 -0.172776 -0.283430 -0.436682 -0.326834 -0.086805 0.084966 0.018643 -0.074296 -0.266289 -0.261326 -0.136950 0.381896 -0.076545 0.404197 0.511732 0.030179 -0.226760 -0.228502 -0.208535 0.240614 -0.150685 -0.156367 0.249672 -0.168690 -0.230010 -0.151192 -0.130300 -0.172616 0.086165 0.097631 0.101098 0.096775 0.098406 0.100028 0.102223 0.091048 0.141347 0.140117 0.135848 0.147595 0.160759 0.158742 0.158678 0.147041 0.158973 0.157951 0.157937
qa: -0.0704 -0.1713 -0.1730 -0.1728 -0.2834 -0.4367 -0.3268 -0.0868 0.0850 0.0186 -0.0743 -0.2663 -0.2613 -0.1369 0.3819 -0.0765 0.4042 0.5117 0.0302 -0.2268 -0.2285 -0.2085 0.2406 -0.1507 -0.1564 0.2497 -0.1687 -0.2300 -0.1512 -0.1303 -0.1726 0.0862 0.0976 0.1011 0.0968 0.0984 0.1000 0.1022 0.0910 0.1413 0.1401 0.1358 0.1476 0.1608 0.1587 0.1587 0.1470 0.1590 0.1580 0.1579
va: 1.2628 1.1327 1.1247 1.1279 2.1227 2.0780 2.0712 3.1123 3.7462 3.8658 3.8565 3.9041 3.9118 3.8881 4.1922 3.9926 3.7183 4.4829 3.6449 4.0767 4.0828 3.9621 3.7838 3.9287 3.8985 3.7140 3.9078 4.0008 3.8964 3.8878 3.8961 1.0449 1.0350 0.9996 1.0186 1.0004 1.0011 1.0008 1.0059 1.0180 1.0211 1.0176 1.0129 0.9911 0.9951 0.9956 1.0068 0.9904 0.9893 0.9903
dispcorr: -0.023709906 hartree
energy: -1928.213106379188
dipole: -20.31546 21.28376 0.96830 59.48252 -56.77926 2.70326 6.26712 -6.38388 -0.11676
magnitude: 2.87382 au
magnitude: 7.30467 debye
