program: Orca
programVersion: 5.0.2
elementType: Cl F F F O O O N C C C C C C C C C C C C C C C C C C C C C C C H H H H H H H H H H H H H H H H H H H
charge: 0
multiplicity: 1
keywords: wb97x-d3
keywords: def2-TZVPP
keywords: def2/J RIJCOSX
keywords: DEFGRID2
keywords: scfconv7
keywords: smallprint printgap noloewdin
keywords: NOSOSCF
formula: C23H19ClF3NO3
InChI: InChI=1/C23H19ClF3NO3/c1-22(2)17(12-19(24)23(25,26)27)20(22)21(29)31-18(13-28)14-7-6-10-16(11-14)30-15-8-4-3-5-9-15/h3-12,17-18,20H,1-2H3
50 atoms
Cl 3.968315 -3.847338 1.20534
F  3.905082 -4.992657 -2.5035
F  3.757363 -6.158123 -0.700153
F  5.534119 -5.020514 -1.097193
O  -1.267054 -0.991091 -0.746863
O  -0.017834 -0.441066 1.024276
O  -3.209571 3.627833 2.028806
N  -4.317152 -2.226674 -0.99212
C  2.309265 -0.357511 -1.053581
C  2.298476 -1.719685 -0.417531
C  1.02226 -1.149203 -1.018086
C  2.520333 0.831172 -0.147804
C  2.927795 -0.169256 -2.418314
C  2.898357 -2.87981 -1.076371
C  -0.094205 -0.812624 -0.117635
C  3.611739 -3.830871 -0.484852
C  -2.449299 -0.684549 -0.012995
C  4.200987 -5.001951 -1.204212
C  -2.818203 0.772041 -0.145384
C  -3.488571 -1.549113 -0.576016
C  -2.835533 1.573919 0.984109
C  -3.109263 1.306316 -1.396809
C  -3.169489 2.919255 0.868124
C  -3.439628 2.646547 -1.497065
C  -3.480081 3.460162 -0.372715
C  -3.095097 4.99525 2.007821
C  -1.992594 5.616727 1.435341
C  -4.087833 5.735766 2.629554
C  -1.897735 6.999601 1.481095
C  -3.973848 7.118776 2.679608
C  -2.885492 7.754936 2.100375
H  2.337133 -1.713073 0.665691
H  0.718645 -1.572896 -1.968439
H  2.237655 0.645606 0.885202
H  3.577881 1.100845 -0.152368
H  1.958953 1.696409 -0.505267
H  4.015019 -0.113568 -2.340825
H  2.6811 -0.965869 -3.118859
H  2.578703 0.766553 -2.857972
H  2.740147 -2.9754 -2.143768
H  -2.34169 -0.956301 1.041418
H  -2.600004 1.161533 1.957994
H  -3.090207 0.685494 -2.284196
H  -3.680654 3.071113 -2.462685
H  -3.758763 4.500653 -0.476697
H  -1.2146 5.030961 0.96101
H  -4.938518 5.23455 3.074093
H  -1.041178 7.487467 1.03412
H  -4.746509 7.698894 3.167426
H  -2.803473 8.833366 2.134532
elementType: Cl F O N C H
totalener: -1928.19007061 hartree
nucrepener: 3011.33645989 hartree
electener: -4939.52653050 hartree
oneelecener: -8629.36643702 hartree
twoeener: 3689.83990652 hartree
cpcmener: -0.03278629 hartree
kineticenergy: 1921.62058019 hartree
xcener: -157.112791571867 hartree
chargesum: 0.0000000
charge: -0.070288 -0.171385 -0.172917 -0.173320 -0.280426 -0.445120 -0.322754 -0.088209 0.085356 0.023706 -0.080420 -0.272062 -0.262928 -0.140223 0.400050 -0.077335 0.403829 0.512525 0.007293 -0.223454 -0.213134 -0.215422 0.270971 -0.153825 -0.176806 0.255603 -0.186486 -0.221856 -0.145071 -0.132424 -0.170188 0.085947 0.097867 0.097233 0.098438 0.103569 0.102477 0.091064 0.100145 0.141634 0.135512 0.135061 0.147856 0.161003 0.155651 0.160474 0.146546 0.159059 0.158393 0.158789
qa: -0.0703 -0.1714 -0.1729 -0.1733 -0.2804 -0.4451 -0.3228 -0.0882 0.0854 0.0237 -0.0804 -0.2721 -0.2629 -0.1402 0.4001 -0.0773 0.4038 0.5125 0.0073 -0.2235 -0.2131 -0.2154 0.2710 -0.1538 -0.1768 0.2556 -0.1865 -0.2219 -0.1451 -0.1324 -0.1702 0.0859 0.0979 0.0972 0.0984 0.1036 0.1025 0.0911 0.1001 0.1416 0.1355 0.1351 0.1479 0.1610 0.1557 0.1605 0.1465 0.1591 0.1584 0.1588
va: 1.2628 1.1323 1.1271 1.1252 2.1364 2.0683 2.0811 3.1109 3.7385 3.8533 3.8748 3.9054 3.9133 3.8835 4.1768 3.9945 3.7338 4.4815 3.6445 4.0728 4.0525 3.9876 3.7804 3.9391 3.9034 3.7046 3.9307 4.0059 3.8881 3.8872 3.8956 1.0451 1.0340 1.0184 1.0000 0.9985 1.0004 1.0064 1.0009 1.0175 1.0198 1.0230 1.0084 0.9914 0.9978 0.9948 1.0064 0.9903 0.9894 0.9901
dispcorr: -0.023667612 hartree
energy: -1928.213738221210
dipole: -24.52856 25.08892 0.56036 57.22655 -54.18797 3.03858 -1.01650 0.07439 -0.94210
magnitude: 3.23025 au
magnitude: 8.21065 debye
