program: Orca
programVersion: 5.0.2
elementType: Cl F F F O O O N C C C C C C C C C C C C C C C C C C C C C C C H H H H H H H H H H H H H H H H H H H
charge: 0
multiplicity: 1
keywords: wb97x-d3
keywords: def2-TZVPP
keywords: def2/J RIJCOSX
keywords: DEFGRID2
keywords: scfconv7
keywords: smallprint printgap noloewdin
keywords: NOSOSCF
formula: C23H19ClF3NO3
InChI: InChI=1/C23H19ClF3NO3/c1-22(2)17(12-19(24)23(25,26)27)20(22)21(29)31-18(13-28)14-7-6-10-16(11-14)30-15-8-4-3-5-9-15/h3-12,17-18,20H,1-2H3
50 atoms
Cl 2.952235 -5.198185 -1.925084
F  5.849337 -4.426972 -1.395791
F  5.500523 -2.3052 -1.470598
F  5.083271 -3.53064 -3.190994
O  -0.922462 -0.302604 -0.478691
O  -1.324716 -2.500911 -0.666831
O  -1.798037 4.118128 1.665707
N  -2.0148 1.024925 -3.337377
C  1.180733 -2.631173 1.262129
C  1.579938 -2.983073 -0.145006
C  0.798059 -1.711187 0.124843
C  0.14784 -3.506437 1.926958
C  2.212625 -2.096849 2.226147
C  2.957558 -2.838229 -0.615287
C  -0.583247 -1.599776 -0.37813
C  3.618465 -3.702455 -1.376174
C  -2.226176 0.043686 -0.922226
C  5.017753 -3.485945 -1.855948
C  -2.815765 1.063612 0.018471
C  -2.097168 0.590287 -2.277325
C  -2.06439 2.170552 0.395232
C  -4.10543 0.89015 0.497599
C  -2.606304 3.09267 1.27568
C  -4.638782 1.828877 1.370661
C  -3.89728 2.928155 1.769358
C  -2.337245 5.356231 1.902615
C  -3.192188 5.961221 0.98949
C  -1.953162 6.012691 3.062119
C  -3.667713 7.237129 1.252897
C  -2.429054 7.293574 3.307665
C  -3.29151 7.907274 2.410054
H  1.00693 -3.79038 -0.586466
H  1.362819 -0.786923 0.080031
H  0.64953 -4.296556 2.487762
H  -0.449055 -2.928879 2.63517
H  -0.530197 -3.986567 1.225508
H  2.903853 -1.390252 1.768651
H  1.720609 -1.579603 3.051441
H  2.798808 -2.914468 2.649286
H  3.480948 -1.9344 -0.327836
H  -2.878207 -0.832175 -0.980201
H  -1.059989 2.323046 0.01744
H  -4.687932 0.027772 0.199131
H  -5.640622 1.696335 1.757126
H  -4.320983 3.64111 2.465211
H  -3.481233 5.450145 0.079157
H  -1.283795 5.527399 3.761619
H  -4.332951 7.711257 0.542829
H  -2.127695 7.80809 4.211114
H  -3.665054 8.903382 2.607671
elementType: Cl F O N C H
totalener: -1928.18931006 hartree
nucrepener: 2986.70976600 hartree
electener: -4914.89907606 hartree
oneelecener: -8580.13372705 hartree
twoeener: 3665.23465099 hartree
cpcmener: -0.03328834 hartree
kineticenergy: 1921.62651109 hartree
xcener: -157.113373265457 hartree
chargesum: 0.0000000
charge: -0.069949 -0.173173 -0.171252 -0.173030 -0.285353 -0.438703 -0.328005 -0.087495 0.081558 0.029784 -0.101506 -0.267784 -0.257014 -0.143040 0.407726 -0.078388 0.419604 0.511793 0.011556 -0.229079 -0.232485 -0.178477 0.226427 -0.138783 -0.162570 0.246540 -0.166841 -0.227718 -0.152250 -0.131303 -0.173482 0.084335 0.099340 0.098865 0.102035 0.095664 0.090851 0.099759 0.102665 0.143201 0.127362 0.137730 0.148591 0.160860 0.158640 0.159090 0.146870 0.159821 0.158171 0.158844
qa: -0.0699 -0.1732 -0.1713 -0.1730 -0.2854 -0.4387 -0.3280 -0.0875 0.0816 0.0298 -0.1015 -0.2678 -0.2570 -0.1430 0.4077 -0.0784 0.4196 0.5118 0.0116 -0.2291 -0.2325 -0.1785 0.2264 -0.1388 -0.1626 0.2465 -0.1668 -0.2277 -0.1522 -0.1313 -0.1735 0.0843 0.0993 0.0989 0.1020 0.0957 0.0909 0.0998 0.1027 0.1432 0.1274 0.1377 0.1486 0.1609 0.1586 0.1591 0.1469 0.1598 0.1582 0.1588
va: 1.2629 1.1252 1.1321 1.1269 2.1399 2.0799 2.0702 3.1115 3.7534 3.8368 3.8641 3.9102 3.9090 3.8801 4.1947 3.9954 3.6696 4.4820 3.7543 4.0798 4.0755 3.9439 3.8067 3.9117 3.9025 3.7166 3.9046 3.9999 3.8955 3.8911 3.8957 1.0469 1.0320 1.0003 0.9991 1.0178 1.0058 1.0016 1.0006 1.0165 1.0418 1.0273 1.0000 0.9911 0.9949 0.9954 1.0068 0.9902 0.9893 0.9900
dispcorr: -0.023131144 hartree
energy: -1928.212441204439
dipole: -38.83723 37.54861 -1.28862 33.72880 -32.63997 1.08883 34.09194 -30.88028 3.21167
magnitude: 3.62779 au
magnitude: 9.22112 debye
