program: Orca
programVersion: 5.0.2
elementType: Cl F F F O O O N C C C C C C C C C C C C C C C C C C C C C C C H H H H H H H H H H H H H H H H H H H
charge: 0
multiplicity: 1
keywords: wb97x-d3
keywords: def2-TZVPP
keywords: def2/J RIJCOSX
keywords: DEFGRID2
keywords: scfconv7
keywords: smallprint printgap noloewdin
keywords: NOSOSCF
formula: C23H19ClF3NO3
InChI: InChI=1/C23H19ClF3NO3/c1-22(2)17(12-19(24)23(25,26)27)20(22)21(29)31-18(13-28)14-7-6-10-16(11-14)30-15-8-4-3-5-9-15/h3-12,17-18,20H,1-2H3
50 atoms
Cl 2.066008 -2.511672 -3.288985
F  4.834851 -1.328031 -3.247477
F  4.908215 -3.474145 -3.252193
F  5.508756 -2.382206 -1.498082
O  -0.972636 -1.164006 0.224809
O  -0.234145 -0.090514 2.036478
O  -2.896731 4.427048 0.723458
N  -3.841865 -1.651431 -1.317232
C  1.168136 -3.242797 1.096045
C  1.500761 -2.532373 -0.190089
C  1.16086 -1.731037 1.055348
C  -0.123121 -4.023505 1.147387
C  2.262223 -3.875555 1.921463
C  2.868245 -2.468889 -0.710147
C  -0.062361 -0.911523 1.172822
C  3.211219 -2.462719 -1.994146
C  -2.176861 -0.410762 0.268894
C  4.62168 -2.411213 -2.492114
C  -1.980065 1.008303 -0.211144
C  -3.100457 -1.122459 -0.617975
C  -2.529487 2.049301 0.521218
C  -1.266168 1.255332 -1.377933
C  -2.350355 3.356245 0.083159
C  -1.100093 2.563834 -1.802448
C  -1.632892 3.617502 -1.075833
C  -3.026266 4.440134 2.086797
C  -2.007952 4.014192 2.931131
C  -4.202665 4.964416 2.60235
C  -2.185024 4.108665 4.303882
C  -4.359909 5.064409 3.977302
C  -3.356986 4.63217 4.833655
H  0.72022 -2.575314 -0.939666
H  1.994496 -1.266052 1.569601
H  -0.545543 -4.004656 2.153935
H  -0.880995 -3.662462 0.455573
H  0.073079 -5.066899 0.894026
H  3.165562 -3.269529 1.978958
H  1.912641 -4.03086 2.943725
H  2.534283 -4.850638 1.513189
H  3.671929 -2.422118 0.01555
H  -2.611953 -0.417986 1.273558
H  -3.089876 1.835876 1.42346
H  -0.841168 0.44239 -1.953373
H  -0.543538 2.769527 -2.707188
H  -1.49712 4.63952 -1.406493
H  -1.083939 3.615258 2.531143
H  -4.985013 5.296711 1.93136
H  -1.393068 3.775408 4.962126
H  -5.276977 5.476937 4.377757
H  -3.485113 4.70608 5.905522
elementType: Cl F O N C H
totalener: -1928.18788110 hartree
nucrepener: 3105.34085776 hartree
electener: -5033.52873887 hartree
oneelecener: -8817.29514840 hartree
twoeener: 3783.76640954 hartree
cpcmener: -0.03420029 hartree
kineticenergy: 1921.59848134 hartree
xcener: -157.110073946202 hartree
chargesum: -0.0000000
charge: -0.073199 -0.173196 -0.173026 -0.171227 -0.273003 -0.432223 -0.326139 -0.084537 0.078130 0.039517 -0.081405 -0.261908 -0.273627 -0.155729 0.404834 -0.067453 0.370040 0.508572 0.018146 -0.227559 -0.186539 -0.212588 0.274223 -0.130397 -0.221731 0.282413 -0.192503 -0.248190 -0.139726 -0.119082 -0.186473 0.087122 0.102295 0.103465 0.093614 0.098263 0.093388 0.100287 0.102878 0.141306 0.142174 0.143367 0.144114 0.158334 0.148620 0.154931 0.146430 0.159922 0.157160 0.157912
qa: -0.0732 -0.1732 -0.1730 -0.1712 -0.2730 -0.4322 -0.3261 -0.0845 0.0781 0.0395 -0.0814 -0.2619 -0.2736 -0.1557 0.4048 -0.0675 0.3700 0.5086 0.0181 -0.2276 -0.1865 -0.2126 0.2742 -0.1304 -0.2217 0.2824 -0.1925 -0.2482 -0.1397 -0.1191 -0.1865 0.0871 0.1023 0.1035 0.0936 0.0983 0.0934 0.1003 0.1029 0.1413 0.1422 0.1434 0.1441 0.1583 0.1486 0.1549 0.1464 0.1599 0.1572 0.1579
va: 1.2596 1.1258 1.1259 1.1328 2.1283 2.0797 2.0840 3.1071 3.7697 3.8067 3.8640 3.9130 3.9152 3.8823 4.1742 3.9882 3.7626 4.4862 3.6224 4.0672 3.9462 3.9613 3.7420 3.9211 4.0008 3.6926 3.9152 4.0115 3.8882 3.8816 3.9072 1.0393 1.0277 0.9997 1.0110 1.0005 1.0065 1.0005 1.0000 1.0182 1.0185 1.0066 1.0120 0.9894 1.0050 0.9996 1.0078 0.9899 0.9893 0.9906
dispcorr: -0.025140683 hartree
energy: -1928.213021785787
dipole: -28.61222 29.20653 0.59431 11.18369 -11.38536 -0.20167 37.16747 -35.06097 2.10650
magnitude: 2.19801 au
magnitude: 5.58689 debye
