program: Orca
programVersion: 5.0.2
elementType: Cl F F F O O O N C C C C C C C C C C C C C C C C C C C C C C C H H H H H H H H H H H H H H H H H H H
charge: 0
multiplicity: 1
keywords: wb97x-d3
keywords: def2-TZVPP
keywords: def2/J RIJCOSX
keywords: DEFGRID2
keywords: scfconv7
keywords: smallprint printgap noloewdin
keywords: NOSOSCF
formula: C23H19ClF3NO3
InChI: InChI=1/C23H19ClF3NO3/c1-22(2)17(12-19(24)23(25,26)27)20(22)21(29)31-18(13-28)14-7-6-10-16(11-14)30-15-8-4-3-5-9-15/h3-12,17-18,20H,1-2H3
50 atoms
Cl 3.01585 -5.512578 -0.064618
F  3.475338 -5.761632 -3.069352
F  5.308747 -5.667906 -1.957314
F  4.730211 -4.017952 -3.210476
O  -0.371057 -0.169141 -0.623388
O  -0.163962 -1.63951 1.05744
O  -3.391586 3.880771 2.238415
N  -3.230356 -0.799896 -2.213992
C  2.898798 -1.058955 0.52995
C  2.507388 -2.399057 -0.030147
C  1.695193 -1.165059 -0.380443
C  2.727227 -0.849619 2.013975
C  4.092063 -0.324837 -0.032001
C  3.265258 -3.035763 -1.107744
C  0.314003 -1.052252 0.123745
C  3.527985 -4.332894 -1.217606
C  -1.720166 0.123197 -0.2894
C  4.265644 -4.940562 -2.368115
C  -1.894948 1.614767 -0.143193
C  -2.556389 -0.394681 -1.37682
C  -2.582558 2.105109 0.955113
C  -1.385839 2.484182 -1.10231
C  -2.751933 3.476328 1.106769
C  -1.554772 3.848096 -0.933068
C  -2.229566 4.356438 0.168458
C  -4.116604 5.043276 2.261054
C  -3.97169 5.854506 3.376879
C  -5.014512 5.373687 1.253247
C  -4.736712 7.007189 3.48624
C  -5.762753 6.536292 1.369966
C  -5.629639 7.356221 2.483072
H  2.039616 -3.067552 0.683352
H  1.841474 -0.763251 -1.376691
H  3.654469 -1.10964 2.526949
H  2.513684 0.198501 2.231717
H  1.934819 -1.453974 2.44915
H  5.016987 -0.722231 0.389622
H  4.164851 -0.385507 -1.117157
H  4.036335 0.732924 0.230073
H  3.632556 -2.391061 -1.897032
H  -2.02463 -0.38359 0.630541
H  -2.983589 1.429541 1.701558
H  -0.860571 2.109026 -1.971328
H  -1.152053 4.533726 -1.666873
H  -2.336808 5.427091 0.285221
H  -3.2707 5.580166 4.155311
H  -5.137542 4.734327 0.387859
H  -4.626105 7.637119 4.35948
H  -6.461059 6.796779 0.585004
H  -6.220418 8.258724 2.568635
elementType: Cl F O N C H
totalener: -1928.18915719 hartree
nucrepener: 2961.71308097 hartree
electener: -4889.90223816 hartree
oneelecener: -8530.00344133 hartree
twoeener: 3640.10120317 hartree
cpcmener: -0.03324313 hartree
kineticenergy: 1921.61464647 hartree
xcener: -157.112093875511 hartree
chargesum: -0.0000000
charge: -0.070267 -0.172911 -0.173039 -0.171352 -0.284611 -0.438180 -0.323716 -0.087990 0.082276 0.027381 -0.100455 -0.267545 -0.258856 -0.141001 0.406544 -0.076273 0.417578 0.510694 0.022353 -0.228103 -0.220951 -0.224472 0.273368 -0.138691 -0.185002 0.283847 -0.244549 -0.198181 -0.123363 -0.141487 -0.180904 0.082869 0.100031 0.099660 0.101853 0.095985 0.102495 0.090939 0.099627 0.141436 0.127216 0.137218 0.149351 0.160996 0.157257 0.146893 0.158931 0.157834 0.159269 0.158000
qa: -0.0703 -0.1729 -0.1730 -0.1714 -0.2846 -0.4382 -0.3237 -0.0880 0.0823 0.0274 -0.1005 -0.2675 -0.2589 -0.1410 0.4065 -0.0763 0.4176 0.5107 0.0224 -0.2281 -0.2210 -0.2245 0.2734 -0.1387 -0.1850 0.2838 -0.2445 -0.1982 -0.1234 -0.1415 -0.1809 0.0829 0.1000 0.0997 0.1019 0.0960 0.1025 0.0909 0.0996 0.1414 0.1272 0.1372 0.1494 0.1610 0.1573 0.1469 0.1589 0.1578 0.1593 0.1580
va: 1.2627 1.1249 1.1273 1.1321 2.1353 2.0807 2.0821 3.1114 3.7564 3.8450 3.8543 3.9106 3.9093 3.8854 4.2013 3.9946 3.6613 4.4835 3.7524 4.0806 4.0493 3.9867 3.7706 3.9213 3.9189 3.6850 4.0100 3.9228 3.8844 3.8903 3.9044 1.0482 1.0319 1.0003 0.9992 1.0177 1.0006 1.0062 1.0015 1.0177 1.0438 1.0166 1.0113 0.9909 0.9959 1.0076 0.9957 0.9893 0.9902 0.9905
dispcorr: -0.022997447 hartree
energy: -1928.212154642294
dipole: -22.55037 23.52189 0.97152 56.65059 -53.30135 3.34924 22.26639 -21.34092 0.92547
magnitude: 3.60801 au
magnitude: 9.17084 debye
