program: Orca
programVersion: 5.0.2
elementType: Cl F F F O O O N C C C C C C C C C C C C C C C C C C C C C C C H H H H H H H H H H H H H H H H H H H
charge: 0
multiplicity: 1
keywords: wb97x-d3
keywords: def2-TZVPP
keywords: def2/J RIJCOSX
keywords: DEFGRID2
keywords: scfconv7
keywords: smallprint printgap noloewdin
keywords: NOSOSCF
formula: C23H19ClF3NO3
InChI: InChI=1/C23H19ClF3NO3/c1-22(2)17(12-19(24)23(25,26)27)20(22)21(29)31-18(13-28)14-7-6-10-16(11-14)30-15-8-4-3-5-9-15/h3-12,17-18,20H,1-2H3
50 atoms
Cl 3.144293 -5.205058 -1.806806
F  5.310028 -3.48774 -2.98759
F  5.988647 -4.426883 -1.180377
F  5.652748 -2.301919 -1.222866
O  -1.040359 -0.446913 -0.060113
O  -1.158145 -2.5083 -0.914375
O  -1.786379 4.323567 1.215843
N  -2.423939 0.317278 -3.040131
C  1.199027 -2.744663 1.280571
C  1.653804 -3.000371 -0.13427
C  0.843838 -1.76612 0.183775
C  0.147847 -3.667196 1.845207
C  2.188577 -2.263874 2.312982
C  3.051479 -2.828843 -0.532657
C  -0.534059 -1.660013 -0.333795
C  3.763984 -3.693334 -1.244942
C  -2.373106 -0.181406 -0.471449
C  5.183388 -3.47134 -1.656296
C  -2.883324 1.002249 0.310287
C  -2.389691 0.091355 -1.914514
C  -2.129526 2.166495 0.385395
C  -4.109645 0.91275 0.952802
C  -2.601458 3.236591 1.130937
C  -4.573428 1.995724 1.685762
C  -3.825563 3.156915 1.787957
C  -2.331984 5.565597 1.425101
C  -1.880996 6.301552 2.509072
C  -3.266613 6.091233 0.542445
C  -2.36862 7.586721 2.707096
C  -3.752132 7.37236 0.757182
C  -3.307357 8.123407 1.837717
H  1.111914 -3.789221 -0.642931
H  1.378602 -0.823086 0.221891
H  0.627823 -4.506453 2.35128
H  -0.46472 -3.144645 2.582438
H  -0.515246 -4.081458 1.08772
H  1.661381 -1.804996 3.151018
H  2.769314 -3.100662 2.705347
H  2.887419 -1.52326 1.92573
H  3.543292 -1.91296 -0.227486
H  -3.021484 -1.043914 -0.29429
H  -1.176671 2.252021 -0.123536
H  -4.695605 0.004983 0.888564
H  -5.524426 1.931309 2.197443
H  -4.194647 3.983702 2.38104
H  -1.150954 5.875936 3.186172
H  -3.607385 5.512407 -0.307393
H  -2.014865 8.165211 3.550622
H  -4.478802 7.78677 0.070449
H  -3.688285 9.123434 1.997844
elementType: Cl F O N C H
totalener: -1928.19045554 hartree
nucrepener: 2980.28673938 hartree
electener: -4908.47719491 hartree
oneelecener: -8567.43355315 hartree
twoeener: 3658.95635824 hartree
cpcmener: -0.03511033 hartree
kineticenergy: 1921.63171687 hartree
xcener: -157.113581389921 hartree
chargesum: -0.0000000
charge: -0.070728 -0.173024 -0.173293 -0.171298 -0.278351 -0.433362 -0.325959 -0.084936 0.078571 0.021313 -0.077157 -0.260669 -0.255609 -0.144103 0.386523 -0.078240 0.414761 0.511513 0.003816 -0.233917 -0.224732 -0.179365 0.224889 -0.146224 -0.163907 0.232570 -0.214491 -0.163688 -0.137006 -0.152231 -0.166045 0.081822 0.103880 0.099819 0.102648 0.094465 0.099823 0.103503 0.089872 0.145501 0.127981 0.138304 0.147088 0.160274 0.155596 0.147105 0.159587 0.158467 0.159452 0.159193
qa: -0.0707 -0.1730 -0.1733 -0.1713 -0.2784 -0.4334 -0.3260 -0.0849 0.0786 0.0213 -0.0772 -0.2607 -0.2556 -0.1441 0.3865 -0.0782 0.4148 0.5115 0.0038 -0.2339 -0.2247 -0.1794 0.2249 -0.1462 -0.1639 0.2326 -0.2145 -0.1637 -0.1370 -0.1522 -0.1660 0.0818 0.1039 0.0998 0.1026 0.0945 0.0998 0.1035 0.0899 0.1455 0.1280 0.1383 0.1471 0.1603 0.1556 0.1471 0.1596 0.1585 0.1595 0.1592
va: 1.2622 1.1266 1.1253 1.1323 2.1612 2.0793 2.0731 3.1118 3.7804 3.8395 3.8592 3.9074 3.9034 3.8757 4.2090 3.9895 3.7158 4.4846 3.7574 4.0321 4.0742 3.9427 3.8132 3.9255 3.8912 3.7255 3.9967 3.9197 3.8911 3.8932 3.8899 1.0507 1.0281 1.0007 0.9999 1.0156 1.0018 1.0005 1.0058 1.0143 1.0267 1.0274 1.0015 0.9916 0.9973 1.0059 0.9951 0.9894 0.9903 0.9898
dispcorr: -0.023273408 hartree
energy: -1928.213728944348
dipole: -39.99303 38.73300 -1.26003 33.99701 -32.55116 1.44585 32.26561 -28.68509 3.58052
magnitude: 4.06181 au
magnitude: 10.32430 debye
