program: Orca
programVersion: 5.0.2
elementType: Cl F F F O O O N C C C C C C C C C C C C C C C C C C C C C C C H H H H H H H H H H H H H H H H H H H
charge: 0
multiplicity: 1
keywords: wb97x-d3
keywords: def2-TZVPP
keywords: def2/J RIJCOSX
keywords: DEFGRID2
keywords: scfconv7
keywords: smallprint printgap noloewdin
keywords: NOSOSCF
formula: C23H19ClF3NO3
InChI: InChI=1/C23H19ClF3NO3/c1-22(2)17(12-19(24)23(25,26)27)20(22)21(29)31-18(13-28)14-7-6-10-16(11-14)30-15-8-4-3-5-9-15/h3-12,17-18,20H,1-2H3
50 atoms
Cl 3.073693 -5.217213 -2.069459
F  5.884476 -4.826068 -1.200902
F  5.789346 -2.692805 -0.922384
F  5.492345 -3.544904 -2.876346
O  -0.979396 -0.380957 -0.179283
O  -1.033943 -2.249419 -1.402278
O  -1.794141 4.287309 1.5234
N  -2.146235 0.831059 -3.104249
C  1.062152 -2.806997 1.042048
C  1.627093 -3.026318 -0.342432
C  0.875157 -1.756747 -0.027538
C  -0.100105 -3.675524 1.455382
C  1.97667 -2.446529 2.186175
C  3.067174 -2.954375 -0.599862
C  -0.455105 -1.532033 -0.63048
C  3.769394 -3.826405 -1.314514
C  -2.277318 -0.029231 -0.635972
C  5.238225 -3.716595 -1.573925
C  -2.816477 1.058137 0.258113
C  -2.195448 0.436827 -2.026521
C  -2.079104 2.215953 0.473482
C  -4.058124 0.891641 0.85377
C  -2.587412 3.201979 1.305708
C  -4.557045 1.890416 1.677799
C  -3.829163 3.044503 1.914097
C  -2.370793 5.503458 1.792281
C  -3.273287 6.076118 0.905249
C  -1.983361 6.167988 2.945185
C  -3.790205 7.332049 1.185243
C  -2.502157 7.428965 3.208852
C  -3.40911 8.011899 2.335315
H  1.081278 -3.749519 -0.937306
H  1.459169 -0.85273 0.110892
H  -0.743041 -3.146348 2.161581
H  -0.714637 -3.999445 0.616435
H  0.267224 -4.573864 1.954217
H  1.402808 -1.981408 2.989581
H  2.453658 -3.339815 2.593448
H  2.761744 -1.746484 1.902685
H  3.606563 -2.117008 -0.173181
H  -2.950836 -0.890808 -0.612322
H  -1.113544 2.362338 0.002929
H  -4.631233 -0.010418 0.681425
H  -5.521016 1.764853 2.152767
H  -4.226692 3.80603 2.572776
H  -3.564666 5.553707 0.002131
H  -1.278436 5.706384 3.625344
H  -4.490962 7.783438 0.494874
H  -2.198221 7.95177 4.106548
H  -3.81368 8.993238 2.545624
elementType: Cl F O N C H
totalener: -1928.19021903 hartree
nucrepener: 2977.96951957 hartree
electener: -4906.15973860 hartree
oneelecener: -8562.80303420 hartree
twoeener: 3656.64329560 hartree
cpcmener: -0.03560033 hartree
kineticenergy: 1921.60881203 hartree
xcener: -157.109037064583 hartree
chargesum: -0.0000000
charge: -0.071735 -0.173500 -0.171293 -0.173273 -0.275634 -0.427755 -0.326906 -0.085268 0.081052 0.007569 -0.069436 -0.257780 -0.257844 -0.141682 0.378875 -0.075759 0.415161 0.511607 -0.001219 -0.232293 -0.221353 -0.175759 0.216116 -0.147992 -0.158651 0.230612 -0.160742 -0.215082 -0.153433 -0.136720 -0.166185 0.080415 0.107338 0.102483 0.093801 0.101267 0.100079 0.102896 0.090049 0.144370 0.127139 0.138308 0.147133 0.160337 0.156416 0.159552 0.147482 0.159917 0.158120 0.159203
qa: -0.0717 -0.1735 -0.1713 -0.1733 -0.2756 -0.4278 -0.3269 -0.0853 0.0811 0.0076 -0.0694 -0.2578 -0.2578 -0.1417 0.3789 -0.0758 0.4152 0.5116 -0.0012 -0.2323 -0.2214 -0.1758 0.2161 -0.1480 -0.1587 0.2306 -0.1607 -0.2151 -0.1534 -0.1367 -0.1662 0.0804 0.1073 0.1025 0.0938 0.1013 0.1001 0.1029 0.0900 0.1444 0.1271 0.1383 0.1471 0.1603 0.1564 0.1596 0.1475 0.1599 0.1581 0.1592
va: 1.2615 1.1259 1.1324 1.1250 2.1618 2.0840 2.0704 3.1113 3.7816 3.8621 3.8418 3.9070 3.9014 3.8828 4.2239 3.9864 3.7244 4.4849 3.7527 4.0293 4.0734 3.9372 3.8197 3.9272 3.8883 3.7280 3.9167 3.9963 3.8946 3.8915 3.8907 1.0507 1.0267 1.0007 1.0146 1.0003 1.0017 1.0006 1.0058 1.0149 1.0253 1.0265 1.0016 0.9917 0.9965 0.9951 1.0058 0.9901 0.9895 0.9898
dispcorr: -0.023397966 hartree
energy: -1928.213616995297
dipole: -41.71738 40.20146 -1.51592 33.99439 -32.90732 1.08708 32.18770 -28.55099 3.63671
magnitude: 4.08723 au
magnitude: 10.38891 debye
