program: Orca
programVersion: 5.0.2
elementType: Cl F F F O O O N C C C C C C C C C C C C C C C C C C C C C C C H H H H H H H H H H H H H H H H H H H
charge: 0
multiplicity: 1
keywords: wb97x-d3
keywords: def2-TZVPP
keywords: def2/J RIJCOSX
keywords: DEFGRID2
keywords: scfconv7
keywords: smallprint printgap noloewdin
keywords: NOSOSCF
formula: C23H19ClF3NO3
InChI: InChI=1/C23H19ClF3NO3/c1-22(2)17(12-19(24)23(25,26)27)20(22)21(29)31-18(13-28)14-7-6-10-16(11-14)30-15-8-4-3-5-9-15/h3-12,17-18,20H,1-2H3
50 atoms
Cl 3.105999 -4.93587 0.414833
F  5.185413 -5.40837 -1.65134
F  4.345666 -4.146602 -3.178528
F  3.264415 -5.876123 -2.488348
O  -0.922336 -0.522907 -0.844269
O  -0.126333 -0.978267 1.199973
O  -3.559375 3.56356 2.149332
N  -3.804986 -1.75543 -1.90497
C  2.659416 -0.465668 -0.089802
C  2.369801 -1.935047 -0.203961
C  1.347636 -0.915438 -0.689832
C  2.731418 0.116721 1.300687
C  3.626161 0.187887 -1.048741
C  3.028091 -2.775386 -1.20267
C  0.061531 -0.818649 0.02299
C  3.384189 -4.043826 -1.038132
C  -2.243744 -0.365501 -0.337071
C  4.047277 -4.86599 -2.095546
C  -2.629176 1.09168 -0.317012
C  -3.112592 -1.141357 -1.225158
C  -2.91439 1.698143 0.895723
C  -2.659164 1.826427 -1.498406
C  -3.24794 3.047606 0.928725
C  -2.993029 3.16886 -1.450189
C  -3.292985 3.788663 -0.244647
C  -3.385205 4.904561 2.385006
C  -2.144365 5.505493 2.215743
C  -4.470777 5.628579 2.851351
C  -1.999566 6.851832 2.514709
C  -4.308874 6.973234 3.158279
C  -3.078179 7.590083 2.98598
H  2.115037 -2.418781 0.731708
H  1.272188 -0.801006 -1.764987
H  2.158709 -0.442951 2.035424
H  3.771496 0.119283 1.631116
H  2.380831 1.150114 1.309854
H  3.483877 1.269746 -1.038309
H  4.656806 -0.013249 -0.752025
H  3.502653 -0.141556 -2.079732
H  3.242178 -2.324764 -2.164034
H  -2.338065 -0.795354 0.664222
H  -2.882684 1.129648 1.817562
H  -2.432422 1.358713 -2.448704
H  -3.02915 3.748108 -2.363333
H  -3.564618 4.836257 -0.233945
H  -1.298524 4.930024 1.85967
H  -5.430268 5.143276 2.97907
H  -1.034474 7.323825 2.383219
H  -5.15343 7.539834 3.528656
H  -2.95706 8.639122 3.222145
elementType: Cl F O N C H
totalener: -1928.18928085 hartree
nucrepener: 2996.40866999 hartree
electener: -4924.59795084 hartree
oneelecener: -8599.42011846 hartree
twoeener: 3674.82216762 hartree
cpcmener: -0.03272960 hartree
kineticenergy: 1921.62630672 hartree
xcener: -157.113372711741 hartree
chargesum: 0.0000000
charge: -0.069882 -0.173112 -0.172102 -0.172349 -0.283119 -0.443340 -0.325046 -0.088540 0.090878 0.015776 -0.090044 -0.270871 -0.266438 -0.136554 0.407081 -0.073740 0.407125 0.511459 0.016710 -0.222179 -0.203474 -0.222620 0.252309 -0.150388 -0.165498 0.241571 -0.172023 -0.217871 -0.149533 -0.134907 -0.168241 0.086132 0.097787 0.097337 0.097867 0.101586 0.100088 0.103006 0.092132 0.139461 0.127825 0.135501 0.149131 0.160866 0.156351 0.160210 0.147025 0.159304 0.158527 0.158825
qa: -0.0699 -0.1731 -0.1721 -0.1723 -0.2831 -0.4433 -0.3250 -0.0885 0.0909 0.0158 -0.0900 -0.2709 -0.2664 -0.1366 0.4071 -0.0737 0.4071 0.5115 0.0167 -0.2222 -0.2035 -0.2226 0.2523 -0.1504 -0.1655 0.2416 -0.1720 -0.2179 -0.1495 -0.1349 -0.1682 0.0861 0.0978 0.0973 0.0979 0.1016 0.1001 0.1030 0.0921 0.1395 0.1278 0.1355 0.1491 0.1609 0.1564 0.1602 0.1470 0.1593 0.1585 0.1588
va: 1.2634 1.1270 1.1314 1.1259 2.1350 2.0696 2.0748 3.1089 3.7325 3.8626 3.8683 3.9046 3.9149 3.8920 4.1805 3.9954 3.7104 4.4820 3.7001 4.0863 4.0341 3.9890 3.7808 3.9367 3.8973 3.7178 3.9236 3.9999 3.8926 3.8892 3.8932 1.0452 1.0335 1.0189 0.9998 0.9993 1.0007 1.0002 1.0063 1.0191 1.0319 1.0193 1.0079 0.9913 0.9974 0.9945 1.0060 0.9904 0.9893 0.9900
dispcorr: -0.023286300 hartree
energy: -1928.212567148599
dipole: -19.17841 20.16968 0.99128 58.64856 -55.14317 3.50539 15.22529 -15.01366 0.21163
magnitude: 3.64899 au
magnitude: 9.27501 debye
