program: Orca
programVersion: 5.0.2
elementType: Cl F F F O O O N C C C C C C C C C C C C C C C C C C C C C C C H H H H H H H H H H H H H H H H H H H
charge: 0
multiplicity: 1
keywords: wb97x-d3
keywords: def2-TZVPP
keywords: def2/J RIJCOSX
keywords: DEFGRID2
keywords: scfconv7
keywords: smallprint printgap noloewdin
keywords: NOSOSCF
formula: C23H19ClF3NO3
InChI: InChI=1/C23H19ClF3NO3/c1-22(2)17(12-19(24)23(25,26)27)20(22)21(29)31-18(13-28)14-7-6-10-16(11-14)30-15-8-4-3-5-9-15/h3-12,17-18,20H,1-2H3
50 atoms
Cl 2.714199 -5.698431 -1.076537
F  5.49358 -3.508275 -2.672061
F  4.339669 -5.113426 -3.524259
F  5.619209 -5.490948 -1.843257
O  -0.105572 0.085274 -0.429032
O  -0.604713 -2.019958 0.150283
O  -3.893786 3.638268 2.221026
N  -2.318252 0.257068 -2.938454
C  2.431387 -1.826373 1.098814
C  2.256743 -2.751159 -0.076606
C  1.681241 -1.350661 -0.12681
C  1.684936 -2.16666 2.365015
C  3.767687 -1.174327 1.356542
C  3.368826 -3.082111 -0.969829
C  0.215837 -1.181251 -0.111733
C  3.644208 -4.290109 -1.448839
C  -1.477051 0.44682 -0.468395
C  4.780289 -4.59388 -2.373455
C  -1.636773 1.863478 0.027584
C  -1.940981 0.331685 -1.856072
C  -2.687282 2.149482 0.885307
C  -0.768825 2.868604 -0.384609
C  -2.867406 3.447533 1.347014
C  -0.952925 4.155142 0.095823
C  -1.992713 4.4559 0.964523
C  -4.536277 4.846828 2.289566
C  -4.973463 5.510662 1.149814
C  -4.797633 5.355943 3.55253
C  -5.669929 6.70226 1.287738
C  -5.507243 6.542402 3.675505
C  -5.940196 7.223067 2.546461
H  1.52703 -3.537599 0.077822
H  2.210865 -0.624885 -0.733932
H  0.772093 -2.7324 2.190028
H  2.32199 -2.770743 3.013464
H  1.422754 -1.259376 2.912767
H  3.638766 -0.302925 2.000725
H  4.439158 -1.867023 1.867073
H  4.264016 -0.834401 0.448458
H  4.020062 -2.270845 -1.272424
H  -2.086482 -0.228152 0.13843
H  -3.367687 1.368452 1.203816
H  0.043926 2.660413 -1.068167
H  -0.274678 4.94236 -0.206138
H  -2.10797 5.466299 1.335302
H  -4.7813 5.105453 0.164052
H  -4.454072 4.823765 4.430693
H  -6.009881 7.221749 0.401123
H  -5.714208 6.937565 4.661595
H  -6.487877 8.150968 2.645459
elementType: Cl F O N C H
totalener: -1928.18966945 hartree
nucrepener: 2953.00920892 hartree
electener: -4881.19887837 hartree
oneelecener: -8512.64597200 hartree
twoeener: 3631.44709363 hartree
cpcmener: -0.03374007 hartree
kineticenergy: 1921.60619039 hartree
xcener: -157.110204597241 hartree
chargesum: 0.0000000
charge: -0.071243 -0.171446 -0.172783 -0.173559 -0.281395 -0.436680 -0.324448 -0.086904 0.079545 0.023725 -0.089291 -0.264863 -0.259938 -0.143553 0.400963 -0.074250 0.404160 0.511603 0.020815 -0.230165 -0.217041 -0.215918 0.262411 -0.142265 -0.177351 0.275265 -0.190335 -0.241208 -0.143989 -0.125432 -0.178908 0.081142 0.103302 0.094695 0.099845 0.102988 0.100242 0.103087 0.090910 0.143342 0.128580 0.136791 0.149173 0.160418 0.157920 0.158646 0.146855 0.159806 0.158372 0.158363
qa: -0.0712 -0.1714 -0.1728 -0.1736 -0.2814 -0.4367 -0.3244 -0.0869 0.0795 0.0237 -0.0893 -0.2649 -0.2599 -0.1436 0.4010 -0.0742 0.4042 0.5116 0.0208 -0.2302 -0.2170 -0.2159 0.2624 -0.1423 -0.1774 0.2753 -0.1903 -0.2412 -0.1440 -0.1254 -0.1789 0.0811 0.1033 0.0947 0.0998 0.1030 0.1002 0.1031 0.0909 0.1433 0.1286 0.1368 0.1492 0.1604 0.1579 0.1586 0.1469 0.1598 0.1584 0.1584
va: 1.2618 1.1325 1.1265 1.1253 2.1463 2.0787 2.0795 3.1130 3.7687 3.8430 3.8559 3.9104 3.9080 3.8829 4.2088 3.9900 3.6803 4.4839 3.7619 4.0644 4.0551 3.9836 3.7825 3.9202 3.9100 3.6901 3.9203 4.0085 3.8895 3.8853 3.9023 1.0506 1.0286 1.0169 1.0004 0.9992 1.0013 1.0007 1.0059 1.0160 1.0395 1.0165 1.0118 0.9911 0.9957 0.9957 1.0073 0.9900 0.9891 0.9903
dispcorr: -0.023034130 hartree
energy: -1928.212703582601
dipole: -28.30437 29.01858 0.71422 49.33204 -46.51701 2.81503 31.57423 -29.20850 2.36573
magnitude: 3.74582 au
magnitude: 9.52112 debye
