program: Orca
programVersion: 5.0.2
elementType: Cl F F F O O O N C C C C C C C C C C C C C C C C C C C C C C C H H H H H H H H H H H H H H H H H H H
charge: 0
multiplicity: 1
keywords: wb97x-d3
keywords: def2-TZVPP
keywords: def2/J RIJCOSX
keywords: DEFGRID2
keywords: scfconv7
keywords: smallprint printgap noloewdin
keywords: NOSOSCF
formula: C23H19ClF3NO3
InChI: InChI=1/C23H19ClF3NO3/c1-22(2)17(12-19(24)23(25,26)27)20(22)21(29)31-18(13-28)14-7-6-10-16(11-14)30-15-8-4-3-5-9-15/h3-12,17-18,20H,1-2H3
50 atoms
Cl 3.387702 -4.696309 0.820281
F  4.412779 -4.20541 -2.891449
F  3.817217 -5.995669 -1.854454
F  5.576442 -4.934023 -1.233134
O  -1.196722 -0.615973 -0.913979
O  -0.474894 -1.300219 1.094896
O  -3.074091 3.583774 2.133344
N  -4.069506 -1.860987 -2.006556
C  2.298961 -0.475385 -0.086912
C  2.141041 -1.970823 -0.138203
C  1.063675 -1.07489 -0.724599
C  2.229031 0.186821 1.267484
C  3.259565 0.213755 -1.026428
C  2.937049 -2.798167 -1.046705
C  -0.248586 -1.026545 -0.05466
C  3.505746 -3.958535 -0.738709
C  -2.52896 -0.467877 -0.422627
C  4.328511 -4.771233 -1.687722
C  -2.897452 0.992513 -0.380518
C  -3.388563 -1.240363 -1.321378
C  -2.828443 1.65563 0.83629
C  -3.234097 1.682002 -1.540167
C  -3.116161 3.014153 0.89805
C  -3.523532 3.034472 -1.462982
C  -3.472519 3.70872 -0.251481
C  -2.87168 4.934715 2.265074
C  -3.775521 5.65012 3.035212
C  -1.766244 5.557859 1.699168
C  -3.567126 7.006767 3.245071
C  -1.577457 6.916202 1.906086
C  -2.473649 7.645386 2.677609
H  1.881697 -2.427108 0.81014
H  1.024427 -1.005947 -1.805879
H  1.6508 -0.375857 1.996241
H  3.238844 0.298048 1.667141
H  1.795359 1.186426 1.187042
H  3.019011 1.276469 -1.089869
H  4.282769 0.128369 -0.655618
H  3.234747 -0.183966 -2.040238
H  3.07495 -2.433113 -2.057574
H  -2.629095 -0.909394 0.572868
H  -2.55773 1.121812 1.740054
H  -3.282954 1.173621 -2.495231
H  -3.801883 3.576532 -2.357103
H  -3.718833 4.761965 -0.214571
H  -4.630666 5.148558 3.471074
H  -1.05729 4.992786 1.10586
H  -4.269901 7.565036 3.850516
H  -0.718175 7.404998 1.464795
H  -2.31693 8.703956 2.838575
elementType: Cl F O N C H
totalener: -1928.18978709 hartree
nucrepener: 3004.39766579 hartree
electener: -4932.58745287 hartree
oneelecener: -8615.33583670 hartree
twoeener: 3682.74838383 hartree
cpcmener: -0.03206250 hartree
kineticenergy: 1921.59294532 hartree
xcener: -157.107555678072 hartree
chargesum: -0.0000000
charge: -0.070968 -0.171217 -0.172951 -0.173402 -0.276489 -0.441558 -0.323165 -0.088291 0.087384 0.021970 -0.101119 -0.272389 -0.261155 -0.141018 0.414170 -0.074372 0.387675 0.512275 0.008796 -0.219398 -0.206605 -0.207641 0.266603 -0.151481 -0.175045 0.256578 -0.223533 -0.185085 -0.130891 -0.145236 -0.170614 0.083960 0.099535 0.097691 0.099817 0.102373 0.099849 0.103025 0.091080 0.142463 0.131897 0.134765 0.143622 0.161483 0.154991 0.146595 0.159502 0.157929 0.159023 0.158573
qa: -0.0710 -0.1712 -0.1730 -0.1734 -0.2765 -0.4416 -0.3232 -0.0883 0.0874 0.0220 -0.1011 -0.2724 -0.2612 -0.1410 0.4142 -0.0744 0.3877 0.5123 0.0088 -0.2194 -0.2066 -0.2076 0.2666 -0.1515 -0.1750 0.2566 -0.2235 -0.1851 -0.1309 -0.1452 -0.1706 0.0840 0.0995 0.0977 0.0998 0.1024 0.0998 0.1030 0.0911 0.1425 0.1319 0.1348 0.1436 0.1615 0.1550 0.1466 0.1595 0.1579 0.1590 0.1586
va: 1.2619 1.1326 1.1270 1.1249 2.1325 2.0723 2.0796 3.1094 3.7434 3.8438 3.8790 3.9092 3.9120 3.8851 4.1800 3.9910 3.7230 4.4825 3.7266 4.0774 4.0189 3.9974 3.7671 3.9409 3.9092 3.7046 4.0048 3.9278 3.8866 3.8882 3.8959 1.0484 1.0329 1.0176 1.0000 0.9989 1.0013 1.0004 1.0062 1.0167 1.0314 1.0231 1.0085 0.9913 0.9978 1.0066 0.9950 0.9894 0.9902 0.9902
dispcorr: -0.023460385 hartree
energy: -1928.213247473611
dipole: -23.14111 23.79971 0.65860 57.86302 -54.29171 3.57131 11.47011 -11.42725 0.04286
magnitude: 3.63178 au
magnitude: 9.23126 debye
