program: Orca
programVersion: 5.0.2
elementType: Cl F F F O O O N C C C C C C C C C C C C C C C C C C C C C C C H H H H H H H H H H H H H H H H H H H
charge: 0
multiplicity: 1
keywords: wb97x-d3
keywords: def2-TZVPP
keywords: def2/J RIJCOSX
keywords: DEFGRID2
keywords: scfconv7
keywords: smallprint printgap noloewdin
keywords: NOSOSCF
formula: C23H19ClF3NO3
InChI: InChI=1/C23H19ClF3NO3/c1-22(2)17(12-19(24)23(25,26)27)20(22)21(29)31-18(13-28)14-7-6-10-16(11-14)30-15-8-4-3-5-9-15/h3-12,17-18,20H,1-2H3
50 atoms
Cl 2.870431 -5.309876 -1.412223
F  4.760925 -3.917855 -3.304988
F  5.768072 -4.535439 -1.512007
F  5.441647 -2.442137 -1.893466
O  -1.030503 -0.345176 -0.46704
O  -1.240428 -2.558332 -0.171301
O  -2.281201 4.453366 0.497295
N  -2.520391 0.186906 -3.403237
C  1.497016 -2.087478 1.357656
C  1.712631 -2.766777 0.032529
C  0.889696 -1.49337 0.106637
C  0.636017 -2.799063 2.371276
C  2.617461 -1.296163 1.986599
C  3.002501 -2.721783 -0.657333
C  -0.55533 -1.570244 -0.179719
C  3.575382 -3.736319 -1.295242
C  -2.399545 -0.204425 -0.819268
C  4.891348 -3.650908 -2.000751
C  -3.004047 0.963028 -0.080861
C  -2.454577 0.015087 -2.269175
C  -2.363774 2.195858 -0.080862
C  -4.208105 0.794785 0.587191
C  -2.941649 3.266492 0.585127
C  -4.779245 1.87729 1.241234
C  -4.159162 3.115943 1.242732
C  -2.397698 5.40512 1.475377
C  -2.291536 5.093746 2.825343
C  -2.5573 6.719107 1.060292
C  -2.361659 6.115041 3.761577
C  -2.610843 7.731763 2.00746
C  -2.520996 7.434913 3.360057
H  1.134853 -3.67312 -0.105052
H  1.368149 -0.586127 -0.244388
H  1.266157 -3.418219 3.01212
H  0.121179 -2.080039 3.011419
H  -0.111481 -3.449987 1.923544
H  2.21582 -0.604596 2.729184
H  3.315125 -1.962727 2.496891
H  3.183901 -0.704961 1.267995
H  3.533497 -1.777534 -0.651559
H  -2.965563 -1.113368 -0.598991
H  -1.424448 2.340114 -0.601892
H  -4.700848 -0.169074 0.592858
H  -5.723953 1.758217 1.75506
H  -4.628225 3.950571 1.747474
H  -2.152259 4.070073 3.150159
H  -2.631617 6.946104 0.004085
H  -2.283694 5.873573 4.813779
H  -2.730043 8.757103 1.681879
H  -2.569768 8.226225 4.096473
elementType: Cl F O N C H
totalener: -1928.18948154 hartree
nucrepener: 2988.50834986 hartree
electener: -4916.69783140 hartree
oneelecener: -8583.64029348 hartree
twoeener: 3666.94246208 hartree
cpcmener: -0.03359140 hartree
kineticenergy: 1921.60779977 hartree
xcener: -157.110851721663 hartree
chargesum: -0.0000000
charge: -0.070839 -0.172966 -0.173528 -0.171096 -0.285567 -0.438753 -0.322015 -0.087718 0.081001 0.024621 -0.097452 -0.264874 -0.259660 -0.140471 0.408219 -0.075183 0.420957 0.511211 0.009536 -0.228669 -0.248757 -0.183237 0.271310 -0.133802 -0.191497 0.286247 -0.203732 -0.243849 -0.140039 -0.122157 -0.182052 0.081662 0.101109 0.098943 0.101555 0.095205 0.099637 0.102859 0.091377 0.142520 0.126031 0.136785 0.148181 0.160652 0.157354 0.158768 0.146218 0.159352 0.158190 0.158411
qa: -0.0708 -0.1730 -0.1735 -0.1711 -0.2856 -0.4388 -0.3220 -0.0877 0.0810 0.0246 -0.0975 -0.2649 -0.2597 -0.1405 0.4082 -0.0752 0.4210 0.5112 0.0095 -0.2287 -0.2488 -0.1832 0.2713 -0.1338 -0.1915 0.2862 -0.2037 -0.2438 -0.1400 -0.1222 -0.1821 0.0817 0.1011 0.0989 0.1016 0.0952 0.0996 0.1029 0.0914 0.1425 0.1260 0.1368 0.1482 0.1607 0.1574 0.1588 0.1462 0.1594 0.1582 0.1584
va: 1.2620 1.1261 1.1255 1.1327 2.1431 2.0793 2.0851 3.1117 3.7593 3.8395 3.8595 3.9101 3.9096 3.8856 4.1969 3.9912 3.6681 4.4831 3.7610 4.0762 4.0797 3.9486 3.7861 3.9132 3.9165 3.6811 3.9258 4.0126 3.8878 3.8848 3.9045 1.0504 1.0307 1.0003 0.9995 1.0172 1.0015 1.0005 1.0060 1.0169 1.0426 1.0277 1.0003 0.9912 0.9961 0.9956 1.0080 0.9902 0.9892 0.9904
dispcorr: -0.023001629 hartree
energy: -1928.212483167507
dipole: -33.76744 33.06958 -0.69786 38.37079 -36.68755 1.68324 36.23885 -32.73623 3.50262
magnitude: 3.94825 au
magnitude: 10.03565 debye
