program: Orca
programVersion: 5.0.2
elementType: Cl F F F O O O N C C C C C C C C C C C C C C C C C C C C C C C H H H H H H H H H H H H H H H H H H H
charge: 0
multiplicity: 1
keywords: wb97x-d3
keywords: def2-TZVPP
keywords: def2/J RIJCOSX
keywords: DEFGRID2
keywords: scfconv7
keywords: smallprint printgap noloewdin
keywords: NOSOSCF
formula: C23H19ClF3NO3
InChI: InChI=1/C23H19ClF3NO3/c1-22(2)17(12-19(24)23(25,26)27)20(22)21(29)31-18(13-28)14-7-6-10-16(11-14)30-15-8-4-3-5-9-15/h3-12,17-18,20H,1-2H3
50 atoms
Cl 3.095871 -4.297681 0.518172
F  5.036027 -2.22011 -2.122404
F  4.582443 -4.3244 -2.086731
F  5.795702 -3.46727 -0.540457
O  -1.523141 -0.283179 -1.325346
O  -1.414361 -1.658618 0.434565
O  -3.367946 3.912101 0.87153
N  -3.644673 0.058502 -3.831293
C  1.348156 -0.22798 0.844147
C  1.581982 -1.562414 0.190398
C  0.570803 -0.596814 -0.400857
C  0.68386 -0.232819 2.199348
C  2.356024 0.885271 0.685734
C  2.796734 -1.847975 -0.575207
C  -0.863451 -0.930002 -0.347952
C  3.503877 -2.97102 -0.5112
C  -2.931203 -0.436691 -1.367061
C  4.732982 -3.239229 -1.319932
C  -3.64811 0.513935 -0.43381
C  -3.312611 -0.155226 -2.75298
C  -3.123966 1.774635 -0.183465
C  -4.864474 0.13138 0.117764
C  -3.829372 2.646388 0.635447
C  -5.563464 1.020988 0.919157
C  -5.04809 2.280398 1.187188
C  -2.103699 4.075018 1.371685
C  -1.574467 3.21914 2.330119
C  -1.378591 5.169559 0.920834
C  -0.30649 3.471467 2.835565
C  -0.113714 5.409749 1.437832
C  0.429937 4.562096 2.393591
H  1.152626 -2.402191 0.724662
H  0.877585 -0.076484 -1.301225
H  1.448909 -0.179746 2.97572
H  0.035735 0.636933 2.316314
H  0.091787 -1.124604 2.388985
H  2.759332 0.963069 -0.323233
H  1.889771 1.843657 0.923531
H  3.192667 0.745116 1.372664
H  3.145403 -1.078965 -1.254395
H  -3.22734 -1.46879 -1.14988
H  -2.18492 2.087763 -0.624984
H  -5.264944 -0.855151 -0.079727
H  -6.511124 0.727685 1.351952
H  -5.585992 2.974841 1.820399
H  -2.141917 2.370726 2.692523
H  -1.803459 5.827245 0.172692
H  0.103738 2.809837 3.587748
H  0.450634 6.26268 1.083277
H  1.417331 4.751104 2.793782
elementType: Cl F O N C H
totalener: -1928.18883547 hartree
nucrepener: 3148.52715671 hartree
electener: -5076.71599218 hartree
oneelecener: -8903.19508312 hartree
twoeener: 3826.47909093 hartree
cpcmener: -0.03361958 hartree
kineticenergy: 1921.60102323 hartree
xcener: -157.110157421814 hartree
chargesum: 0.0000000
charge: -0.070807 -0.170840 -0.173186 -0.173310 -0.288249 -0.437255 -0.333293 -0.085370 0.104000 0.016360 -0.074488 -0.270663 -0.261716 -0.141667 0.381677 -0.075860 0.402908 0.512369 0.027824 -0.232079 -0.134202 -0.202729 0.183406 -0.121239 -0.203197 0.245315 -0.140754 -0.226958 -0.202042 -0.125577 -0.171600 0.084480 0.099542 0.104051 0.083323 0.103262 0.092859 0.094484 0.102811 0.142896 0.144616 0.147129 0.145645 0.159884 0.150327 0.157905 0.146923 0.166404 0.157791 0.158892
qa: -0.0708 -0.1708 -0.1732 -0.1733 -0.2882 -0.4373 -0.3333 -0.0854 0.1040 0.0164 -0.0745 -0.2707 -0.2617 -0.1417 0.3817 -0.0759 0.4029 0.5124 0.0278 -0.2321 -0.1342 -0.2027 0.1834 -0.1212 -0.2032 0.2453 -0.1408 -0.2270 -0.2020 -0.1256 -0.1716 0.0845 0.0995 0.1041 0.0833 0.1033 0.0929 0.0945 0.1028 0.1429 0.1446 0.1471 0.1456 0.1599 0.1503 0.1579 0.1469 0.1664 0.1578 0.1589
va: 1.2624 1.1330 1.1264 1.1254 2.1160 2.0752 2.0659 3.1147 3.7068 3.8778 3.8657 3.9034 3.9181 3.8883 4.1895 3.9904 3.7164 4.4835 3.6334 4.0774 3.9230 3.9888 3.8068 3.8930 4.0047 3.7281 3.8212 3.9931 3.8794 3.9006 3.8678 1.0471 1.0344 1.0009 1.0083 1.0218 1.0069 1.0015 1.0006 1.0165 1.0212 1.0175 1.0018 0.9889 1.0028 0.9977 1.0073 0.9857 0.9885 0.9901
dispcorr: -0.026892707 hartree
energy: -1928.215728179418
dipole: -27.84179 27.95863 0.11684 38.64339 -37.39200 1.25139 21.46106 -19.62765 1.83341
magnitude: 2.22284 au
magnitude: 5.65001 debye
