program: Orca
programVersion: 5.0.2
elementType: Cl F F F O O O N C C C C C C C C C C C C C C C C C C C C C C C H H H H H H H H H H H H H H H H H H H
charge: 0
multiplicity: 1
keywords: wb97x-d3
keywords: def2-TZVPP
keywords: def2/J RIJCOSX
keywords: DEFGRID2
keywords: scfconv7
keywords: smallprint printgap noloewdin
keywords: NOSOSCF
formula: C23H19ClF3NO3
InChI: InChI=1/C23H19ClF3NO3/c1-22(2)17(12-19(24)23(25,26)27)20(22)21(29)31-18(13-28)14-7-6-10-16(11-14)30-15-8-4-3-5-9-15/h3-12,17-18,20H,1-2H3
50 atoms
Cl 2.612127 0.394591 1.585975
F  4.673763 -2.890598 1.717618
F  4.164902 -1.528664 3.302055
F  5.343306 -0.84518 1.643433
O  -1.639209 -1.326002 0.034264
O  -2.137245 -3.453838 -0.402699
O  -2.238822 3.800716 -0.212038
N  -4.443945 -1.247881 -1.879845
C  0.881965 -2.127742 -1.671156
C  1.152719 -1.687174 -0.255077
C  0.130583 -2.771615 -0.528448
C  0.197262 -1.136718 -2.580317
C  1.871271 -3.007693 -2.394427
C  2.382711 -2.045604 0.451124
C  -1.316349 -2.578334 -0.302335
C  3.069527 -1.240177 1.253611
C  -3.005424 -1.030562 0.294961
C  4.316079 -1.633948 1.977532
C  -3.040392 0.378778 0.825714
C  -3.801275 -1.167775 -0.931263
C  -2.653678 1.43031 0.000735
C  -3.385129 0.602607 2.148902
C  -2.593481 2.713234 0.523375
C  -3.340331 1.896659 2.652057
C  -2.938941 2.950002 1.850971
C  -1.482478 3.654045 -1.347798
C  -1.966352 4.215658 -2.518917
C  -0.245412 3.02165 -1.315357
C  -1.198677 4.147457 -3.673909
C  0.50518 2.94932 -2.479901
C  0.034088 3.51028 -3.660656
H  0.746928 -0.713794 -0.00863
H  0.432849 -3.79063 -0.312667
H  -0.420268 -1.652501 -3.318011
H  -0.434124 -0.425872 -2.050304
H  0.947702 -0.560243 -3.124047
H  2.690532 -2.410475 -2.798842
H  2.300852 -3.782264 -1.760118
H  1.381965 -3.509608 -3.230995
H  2.759295 -3.052424 0.316311
H  -3.41781 -1.722829 1.03529
H  -2.401998 1.245067 -1.036933
H  -3.679748 -0.222143 2.784831
H  -3.60688 2.08329 3.683792
H  -2.891564 3.956636 2.246616
H  -2.931081 4.707421 -2.523909
H  0.1332 2.59148 -0.395499
H  -1.573417 4.59041 -4.587732
H  1.469487 2.457691 -2.459152
H  0.627262 3.454332 -4.563894
elementType: Cl F O N C H
totalener: -1928.18862078 hartree
nucrepener: 3235.09149679 hartree
electener: -5163.28011757 hartree
oneelecener: -9076.37076939 hartree
twoeener: 3913.09065181 hartree
cpcmener: -0.03608473 hartree
kineticenergy: 1921.61950333 hartree
xcener: -157.113172223783 hartree
chargesum: -0.0000000
charge: -0.076758 -0.171029 -0.173548 -0.173482 -0.259521 -0.430215 -0.324407 -0.081602 0.081761 0.070986 -0.101983 -0.242889 -0.267326 -0.158038 0.405059 -0.070467 0.375811 0.508043 0.015515 -0.228781 -0.224159 -0.200324 0.269941 -0.108602 -0.236354 0.276620 -0.227541 -0.189433 -0.130908 -0.163294 -0.159056 0.076226 0.104246 0.108599 0.062749 0.098942 0.101717 0.091391 0.100366 0.142734 0.132687 0.147960 0.146301 0.158437 0.147174 0.146215 0.156481 0.157721 0.157509 0.158528
qa: -0.0768 -0.1710 -0.1735 -0.1735 -0.2595 -0.4302 -0.3244 -0.0816 0.0818 0.0710 -0.1020 -0.2429 -0.2673 -0.1580 0.4051 -0.0705 0.3758 0.5080 0.0155 -0.2288 -0.2242 -0.2003 0.2699 -0.1086 -0.2364 0.2766 -0.2275 -0.1894 -0.1309 -0.1633 -0.1591 0.0762 0.1042 0.1086 0.0627 0.0989 0.1017 0.0914 0.1004 0.1427 0.1327 0.1480 0.1463 0.1584 0.1472 0.1462 0.1565 0.1577 0.1575 0.1585
va: 1.2589 1.1330 1.1261 1.1258 2.1663 2.0746 2.0901 3.1078 3.7646 3.7993 3.8894 3.9178 3.9113 3.8699 4.1854 3.9821 3.7889 4.4881 3.7141 4.0190 3.9493 3.9517 3.7800 3.9038 4.0097 3.6831 4.0091 3.9034 3.8897 3.8723 3.8903 1.0321 1.0277 1.0038 1.0111 1.0015 1.0004 1.0061 1.0009 1.0161 1.0171 1.0053 1.0014 0.9894 1.0066 1.0068 0.9946 0.9893 0.9914 0.9896
dispcorr: -0.027339722 hartree
energy: -1928.215960503880
dipole: -24.08872 25.05357 0.96485 6.85811 -6.55079 0.30732 -28.58835 28.73519 0.14684
magnitude: 1.02320 au
magnitude: 2.60076 debye
