program: Orca
programVersion: 5.0.2
elementType: Cl F F F O O O N C C C C C C C C C C C C C C C C C C C C C C C H H H H H H H H H H H H H H H H H H H
charge: 0
multiplicity: 1
keywords: wb97x-d3
keywords: def2-TZVPP
keywords: def2/J RIJCOSX
keywords: DEFGRID2
keywords: scfconv7
keywords: smallprint printgap noloewdin
keywords: NOSOSCF
formula: C23H19ClF3NO3
InChI: InChI=1/C23H19ClF3NO3/c1-22(2)17(12-19(24)23(25,26)27)20(22)21(29)31-18(13-28)14-7-6-10-16(11-14)30-15-8-4-3-5-9-15/h3-12,17-18,20H,1-2H3
50 atoms
Cl 3.374121 -0.916085 -2.122542
F  5.037719 0.678415 -0.237562
F  5.560265 -1.391459 -0.033404
F  4.505027 -0.393324 1.553295
O  -2.432073 -1.43047 1.197473
O  -1.932965 -1.230264 -0.970402
O  -2.123023 3.549135 0.580883
N  -4.946031 -2.780751 -0.634726
C  0.450547 -3.074951 -0.028134
C  0.950303 -1.680704 -0.303405
C  -0.240103 -1.881115 0.603344
C  -0.195086 -3.827264 -1.164596
C  1.224315 -3.966411 0.911742
C  2.215457 -1.228263 0.287789
C  -1.58122 -1.472616 0.15337
C  3.30227 -0.893684 -0.396884
C  -3.772344 -1.056494 0.945243
C  4.600939 -0.496814 0.228989
C  -3.93333 0.376623 0.473346
C  -4.405275 -2.018238 0.03232
C  -2.950959 1.305999 0.780041
C  -5.076605 0.770493 -0.211806
C  -3.085047 2.61346 0.332759
C  -5.21969 2.093247 -0.602516
C  -4.220129 3.019739 -0.35127
C  -0.802857 3.219569 0.423403
C  0.102039 3.82803 1.281692
C  -0.362551 2.356373 -0.574488
C  1.458051 3.568925 1.140646
C  0.995257 2.098969 -0.694664
C  1.911148 2.697273 0.16044
H  0.728827 -1.306555 -1.296942
H  -0.065247 -1.761876 1.667048
H  0.555347 -4.4453 -1.660772
H  -0.97652 -4.494181 -0.794972
H  -0.632194 -3.179764 -1.921435
H  0.58633 -4.776022 1.270319
H  2.073634 -4.418656 0.396361
H  1.604731 -3.438936 1.785842
H  2.27543 -1.195486 1.369218
H  -4.273008 -1.1744 1.91086
H  -2.071421 1.025226 1.346169
H  -5.857324 0.058863 -0.449575
H  -6.11081 2.400074 -1.134009
H  -4.316017 4.045089 -0.68509
H  -0.254057 4.500909 2.051934
H  -1.060034 1.887488 -1.257251
H  2.161297 4.045581 1.81154
H  1.336029 1.429387 -1.474046
H  2.967504 2.488778 0.059532
elementType: Cl F O N C H
totalener: -1928.18677314 hartree
nucrepener: 3305.85371456 hartree
electener: -5234.04048769 hartree
oneelecener: -9218.46471611 hartree
twoeener: 3984.42422842 hartree
cpcmener: -0.03389123 hartree
kineticenergy: 1921.61286083 hartree
xcener: -157.117720209798 hartree
chargesum: 0.0000000
charge: -0.072207 -0.173038 -0.172281 -0.173100 -0.287904 -0.422873 -0.328965 -0.084283 0.109189 -0.032356 -0.075665 -0.272727 -0.252451 -0.123155 0.373482 -0.086861 0.498935 0.518971 -0.013379 -0.251103 -0.240097 -0.212862 0.274830 -0.112862 -0.234610 0.299022 -0.248996 -0.196015 -0.127127 -0.159312 -0.178509 0.098501 0.099781 0.099784 0.103748 0.097047 0.101318 0.102499 0.090645 0.149936 0.150014 0.148908 0.136658 0.159279 0.147763 0.145030 0.151539 0.156767 0.156824 0.162268
qa: -0.0722 -0.1730 -0.1723 -0.1731 -0.2879 -0.4229 -0.3290 -0.0843 0.1092 -0.0324 -0.0757 -0.2727 -0.2525 -0.1232 0.3735 -0.0869 0.4989 0.5190 -0.0134 -0.2511 -0.2401 -0.2129 0.2748 -0.1129 -0.2346 0.2990 -0.2490 -0.1960 -0.1271 -0.1593 -0.1785 0.0985 0.0998 0.0998 0.1037 0.0970 0.1013 0.1025 0.0906 0.1499 0.1500 0.1489 0.1367 0.1593 0.1478 0.1450 0.1515 0.1568 0.1568 0.1623
va: 1.2580 1.1241 1.1272 1.1305 2.1353 2.0748 2.0875 3.1017 3.8038 3.8369 3.8688 3.9068 3.9016 3.7946 4.1818 3.9487 3.7720 4.4657 3.7221 4.0911 3.9515 3.9727 3.7374 3.9072 4.0304 3.6778 4.0142 3.8863 3.9170 3.8663 3.8718 1.0349 1.0362 1.0010 0.9999 1.0172 1.0021 1.0014 1.0044 1.0111 0.9873 1.0133 1.0129 0.9896 1.0047 1.0080 1.0058 0.9900 0.9935 1.0004
dispcorr: -0.030107233 hartree
energy: -1928.216880368197
dipole: -29.21839 29.18671 -0.03168 -5.22823 5.13189 -0.09634 4.56039 -2.54660 2.01378
magnitude: 2.01633 au
magnitude: 5.12511 debye
